FreeBSD-stable-14-amd64-test - Build #1417 - Still Unstable

From: <jenkins-admin_at_FreeBSD.org>
Date: Fri, 12 Sep 2025 02:51:13 UTC
FreeBSD-stable-14-amd64-test - Build #1417 (36f4d6dc0d3ab0e69ccdd39aa06793ac6b1968c2) - Still Unstable

Build information: https://ci.FreeBSD.org/job/FreeBSD-stable-14-amd64-test/1417/
Full change log: https://ci.FreeBSD.org/job/FreeBSD-stable-14-amd64-test/1417/changes
Full build log: https://ci.FreeBSD.org/job/FreeBSD-stable-14-amd64-test/1417/console

Status explanation:
"Unstable" - some tests are suspected being broken by the following changes
"Still Unstable" - the failing test cases have not been fixed by these
                   following changes and this is a notification to note that
                   these changes have not been fully tested by the CI system

Change summaries:
(Those commits are likely but not certainly responsible)

7dc494e6377451469763a8a687032dee2b8324b2 by kbowling:
ixgbe: Fix incomplete speed coverage in link status logging

36f4d6dc0d3ab0e69ccdd39aa06793ac6b1968c2 by kbowling:
ixgbe: Correct ixgbe_link_speed_to_str comment



The failed test cases:

4 tests failed.
FAILED:  sbin.ipfw.ipfw_test.__test_cases_list__

Error Message:
Unknown test case metadata property 'require.kmods'

FAILED:  sys.net.if_ovpn.if_ovpn.linklocal

Error Message:
atf-check failed; see the output of the test for details

FAILED:  sys.netinet.fibs_test.same_ip_multiple_ifaces_fib0

Error Message:
atf-check failed; see the output of the test for details

FAILED:  sys.netlink.test_netlink_message_writer.py.__test_cases_list__

Error Message:
Test program did not exit cleanly