FreeBSD-main-amd64-gcc13_build - Build #4338 - Still Failing

From: <jenkins-admin_at_FreeBSD.org>
Date: Tue, 02 Sep 2025 22:53:00 UTC
FreeBSD-main-amd64-gcc13_build - Build #4338 (3296fda0c309c873ae37a0a4e25ded3ae04b421c) - Still Failing

Build information: https://ci.FreeBSD.org/job/FreeBSD-main-amd64-gcc13_build/4338/
Full change log: https://ci.FreeBSD.org/job/FreeBSD-main-amd64-gcc13_build/4338/changes
Full build log: https://ci.FreeBSD.org/job/FreeBSD-main-amd64-gcc13_build/4338/console

Status explanation:
"Failure" - the build is suspected being broken by the following changes
"Still Failing" - the build has not been fixed by the following changes and
                  this is a notification to note that these changes have
                  not been fully tested by the CI system

Change summaries:
(Those commits are likely but not certainly responsible)

3296fda0c309c873ae37a0a4e25ded3ae04b421c by emaste:
arm64: enable bloating kernel with ext errors strings



The end of the build log:

[...truncated 93.97 MiB...]
--- all_subdir_tests/sys/capsicum ---
--- .depend.mini-me.noexec ---
echo mini-me.noexec.full: /tmp/obj/workspace/src/amd64.amd64/tmp/usr/lib/libc.a  >> .depend.mini-me.noexec
--- mini-me.noexec.full ---
/usr/local/bin/x86_64-unknown-freebsd14.2-gcc13 --sysroot=/tmp/obj/workspace/src/amd64.amd64/tmp -B/usr/local/x86_64-unknown-freebsd14.2/bin/ -O2 -pipe -fno-common -I/workspace/src/tests -g -std=gnu17 -Wno-format-zero-length -fstack-protector-strong -Wsystem-headers -Werror -Wall -Wno-format-y2k -W -Wno-unused-parameter -Wmissing-prototypes -Wpointer-arith -Wreturn-type -Wcast-qual -Wwrite-strings -Wswitch -Wshadow -Wunused-parameter -Wcast-align -Wchar-subscripts -Wnested-externs -Wold-style-definition -Wno-pointer-sign -Wdate-time -Wno-error=address -Wno-error=array-bounds -Wno-error=attributes -Wno-error=bool-compare -Wno-error=cast-align -Wno-error=clobbered -Wno-error=deprecated-declarations -Wno-error=enum-compare -Wno-error=extra -Wno-error=logical-not-parentheses -Wno-error=strict-aliasing -Wno-error=uninitialized -Wno-error=unused-function -Wno-error=unused-value -Wno-error=empty-body -Wno-error=maybe-uninitialized -Wno-error=nonnull-compare -Wno-error=shift-negative-value -Wno-error=tautological-compare -Wno-error=unused-const-variable -Wno-error=bool-operation -Wno-error=deprecated -Wno-error=expansion-to-defined -Wno-error=format-overflow -Wno-error=format-truncation -Wno-error=implicit-fallthrough -Wno-error=int-in-bool-context -Wno-error=memset-elt-size -Wno-error=noexcept-type -Wno-error=nonnull -Wno-error=pointer-compare -Wno-error=stringop-overflow -Wno-error=aggressive-loop-optimizations -Wno-error=cast-function-type -Wno-error=catch-value -Wno-error=multistatement-macros -Wno-error=restrict -Wno-error=sizeof-pointer-memaccess -Wno-error=stringop-truncation -Wno-return-type  -Wl,-zrelro -static -Wl,-znoexecstack  -o mini-me.noexec.full mini-me.o  
--- all_subdir_rescue ---
--- shutdown_make ---
(cd /workspace/src/rescue/rescue/../../sbin/shutdown &&  make MK_PIE=no NO_SHARED=yes -DRESCUE CRUNCH_CFLAGS=-DRESCUE CRUNCH_CFLAGS+=-I/tmp/obj/workspace/src/amd64.amd64/lib/libifconfig CRUNCH_CFLAGS+=-I/tmp/obj/workspace/src/amd64.amd64/lib/libiscsiutil MK_AUTO_OBJ=yes DIRPRFX=rescue/rescue/shutdown/ depend && make MK_PIE=no NO_SHARED=yes -DRESCUE CRUNCH_CFLAGS=-DRESCUE CRUNCH_CFLAGS+=-I/tmp/obj/workspace/src/amd64.amd64/lib/libifconfig CRUNCH_CFLAGS+=-I/tmp/obj/workspace/src/amd64.amd64/lib/libiscsiutil MK_AUTO_OBJ=yes DIRPRFX=rescue/rescue/shutdown/ shutdown.o)
--- all_subdir_tests ---
--- all_subdir_tests/sys/audit ---
--- .depend.administrative ---
--- all_subdir_lib ---
--- sqrt_test.debug ---
--- all_subdir_tests ---
echo administrative.full: /tmp/obj/workspace/src/amd64.amd64/tmp/usr/lib/libc.a /tmp/obj/workspace/src/amd64.amd64/tmp/usr/lib/libprivateatf-c.a >> .depend.administrative
--- all_subdir_lib ---
/usr/local/x86_64-unknown-freebsd14.2/bin/objcopy --only-keep-debug sqrt_test.full sqrt_test.debug
--- all_subdir_tests ---
--- administrative.o ---
/usr/local/bin/x86_64-unknown-freebsd14.2-gcc13 --sysroot=/tmp/obj/workspace/src/amd64.amd64/tmp -B/usr/local/x86_64-unknown-freebsd14.2/bin/  -O2 -pipe -fno-common -I/workspace/src/contrib/openbsm   -g -MD  -MF.depend.administrative.administrative.o -MTadministrative.o -std=gnu17 -Wno-format-zero-length -fstack-protector-strong -Wsystem-headers -Werror -Wall -Wno-format-y2k -W -Wno-unused-parameter -Wmissing-prototypes -Wpointer-arith -Wreturn-type -Wcast-qual -Wwrite-strings -Wswitch -Wshadow -Wunused-parameter -Wcast-align -Wchar-subscripts -Wnested-externs -Wold-style-definition -Wno-pointer-sign -Wdate-time -Wno-error=address -Wno-error=array-bounds -Wno-error=attributes -Wno-error=bool-compare -Wno-error=cast-align -Wno-error=clobbered -Wno-error=deprecated-declarations -Wno-error=enum-compare -Wno-error=extra -Wno-error=logical-not-parentheses -Wno-error=strict-aliasing -Wno-error=uninitialized -Wno-error=unused-function -Wno-error=unused-value -Wno-error=empty-body -Wno-error=maybe-uninitialized -Wno-error=nonnull-compare -Wno-error=shift-negative-value -Wno-error=tautological-compare -Wno-error=unused-const-variable -Wno-error=bool-operation -Wno-error=deprecated -Wno-error=expansion-to-defined -Wno-error=format-overflow -Wno-error=format-truncation -Wno-error=implicit-fallthrough -Wno-error=int-in-bool-context -Wno-error=memset-elt-size -Wno-error=noexcept-type -Wno-error=nonnull -Wno-error=pointer-compare -Wno-error=stringop-overflow -Wno-error=aggressive-loop-optimizations -Wno-error=cast-function-type -Wno-error=catch-value -Wno-error=multistatement-macros -Wno-error=restrict -Wno-error=sizeof-pointer-memaccess -Wno-error=stringop-truncation -Wno-return-type      -c /workspace/src/tests/sys/audit/administrative.c -o administrative.o
--- all_subdir_lib ---
--- sqrt_test ---
/usr/local/x86_64-unknown-freebsd14.2/bin/objcopy --strip-debug --add-gnu-debuglink=sqrt_test.debug  sqrt_test.full sqrt_test
--- all_subdir_usr.bin ---
In file included from /tmp/obj/workspace/src/amd64.amd64/tmp/usr/include/c++/v1/atomic:599,
                 from /tmp/obj/workspace/src/amd64.amd64/tmp/usr/include/c++/v1/optional:1288,
                 from /tmp/obj/workspace/src/amd64.amd64/tmp/usr/include/c++/v1/__node_handle:65,
                 from /tmp/obj/workspace/src/amd64.amd64/tmp/usr/include/c++/v1/map:589:
/tmp/obj/workspace/src/amd64.amd64/tmp/usr/include/c++/v1/__atomic/atomic_flag.h: In function 'void std::__1::atomic_flag_wait(const volatile atomic_flag*, bool)':
/tmp/obj/workspace/src/amd64.amd64/tmp/usr/include/c++/v1/__atomic/atomic_flag.h:149:12: warning: 'void std::__1::atomic_flag::wait(bool, std::__1::memory_order) const volatile' is deprecated: The C++20 synchronization library has been deprecated prior to C++20. Please update to using -std=c++20 if you need to use these facilities. [-Wdeprecated-declarations]
  149 |   __o->wait(__v);
      |   ~~~~~~~~~^~~~~
--- all_subdir_lib ---
--- tan_test ---
--- all_subdir_usr.bin ---
/tmp/obj/workspace/src/amd64.amd64/tmp/usr/include/c++/v1/__atomic/atomic_flag.h:52:3: note: declared here
   52 |   wait(bool __v, memory_order __m = memory_order_seq_cst) const volatile _NOEXCEPT {
      |   ^~~~
/tmp/obj/workspace/src/amd64.amd64/tmp/usr/include/c++/v1/__atomic/atomic_flag.h: In function 'void std::__1::atomic_flag_wait(const atomic_flag*, bool)':
/tmp/obj/workspace/src/amd64.amd64/tmp/usr/include/c++/v1/__atomic/atomic_flag.h:154:12: warning: 'void std::__1::atomic_flag::wait(bool, std::__1::memory_order) const' is deprecated: The C++20 synchronization library has been deprecated prior to C++20. Please update to using -std=c++20 if you need to use these facilities. [-Wdeprecated-declarations]
  154 |   __o->wait(__v);
      |   ~~~~~~~~~^~~~~
/tmp/obj/workspace/src/amd64.amd64/tmp/usr/include/c++/v1/__atomic/atomic_flag.h:56:3: note: declared here
   56 |   wait(bool __v, memory_order __m = memory_order_seq_cst) const _NOEXCEPT {
      |   ^~~~
/tmp/obj/workspace/src/amd64.amd64/tmp/usr/include/c++/v1/__atomic/atomic_flag.h: In function 'void std::__1::atomic_flag_wait_explicit(const volatile atomic_flag*, bool, memory_order)':
/tmp/obj/workspace/src/amd64.amd64/tmp/usr/include/c++/v1/__atomic/atomic_flag.h:159:12: warning: 'void std::__1::atomic_flag::wait(bool, std::__1::memory_order) const volatile' is deprecated: The C++20 synchronization library has been deprecated prior to C++20. Please update to using -std=c++20 if you need to use these facilities. [-Wdeprecated-declarations]
  159 |   __o->wait(__v, __m);
      |   ~~~~~~~~~^~~~~~~~~~
/tmp/obj/workspace/src/amd64.amd64/tmp/usr/include/c++/v1/__atomic/atomic_flag.h:52:3: note: declared here
   52 |   wait(bool __v, memory_order __m = memory_order_seq_cst) const volatile _NOEXCEPT {
      |   ^~~~
--- all_subdir_lib ---
(cd /workspace/src/lib/msun/tests &&  DEPENDFILE=.depend.tan_test  NO_SUBDIR=1 make -f /workspace/src/lib/msun/tests/Makefile _RECURSING_PROGS=t  PROG=tan_test )
--- all_subdir_usr.bin ---
/tmp/obj/workspace/src/amd64.amd64/tmp/usr/include/c++/v1/__atomic/atomic_flag.h: In function 'void std::__1::atomic_flag_wait_explicit(const atomic_flag*, bool, memory_order)':
/tmp/obj/workspace/src/amd64.amd64/tmp/usr/include/c++/v1/__atomic/atomic_flag.h:164:12: warning: 'void std::__1::atomic_flag::wait(bool, std::__1::memory_order) const' is deprecated: The C++20 synchronization library has been deprecated prior to C++20. Please update to using -std=c++20 if you need to use these facilities. [-Wdeprecated-declarations]
  164 |   __o->wait(__v, __m);
      |   ~~~~~~~~~^~~~~~~~~~
/tmp/obj/workspace/src/amd64.amd64/tmp/usr/include/c++/v1/__atomic/atomic_flag.h:56:3: note: declared here
   56 |   wait(bool __v, memory_order __m = memory_order_seq_cst) const _NOEXCEPT {
      |   ^~~~
/tmp/obj/workspace/src/amd64.amd64/tmp/usr/include/c++/v1/__atomic/atomic_flag.h: In function 'void std::__1::atomic_flag_notify_one(volatile atomic_flag*)':
/tmp/obj/workspace/src/amd64.amd64/tmp/usr/include/c++/v1/__atomic/atomic_flag.h:169:18: warning: 'void std::__1::atomic_flag::notify_one() volatile' is deprecated: The C++20 synchronization library has been deprecated prior to C++20. Please update to using -std=c++20 if you need to use these facilities. [-Wdeprecated-declarations]
  169 |   __o->notify_one();
      |   ~~~~~~~~~~~~~~~^~
/tmp/obj/workspace/src/amd64.amd64/tmp/usr/include/c++/v1/__atomic/atomic_flag.h:59:87: note: declared here
   59 |   _LIBCPP_DEPRECATED_ATOMIC_SYNC _LIBCPP_AVAILABILITY_SYNC _LIBCPP_HIDE_FROM_ABI void notify_one() volatile _NOEXCEPT {
      |                                                                                       ^~~~~~~~~~
/tmp/obj/workspace/src/amd64.amd64/tmp/usr/include/c++/v1/__atomic/atomic_flag.h: In function 'void std::__1::atomic_flag_notify_one(atomic_flag*)':
/tmp/obj/workspace/src/amd64.amd64/tmp/usr/include/c++/v1/__atomic/atomic_flag.h:174:18: warning: 'void std::__1::atomic_flag::notify_one()' is deprecated: The C++20 synchronization library has been deprecated prior to C++20. Please update to using -std=c++20 if you need to use these facilities. [-Wdeprecated-declarations]
  174 |   __o->notify_one();
      |   ~~~~~~~~~~~~~~~^~
/tmp/obj/workspace/src/amd64.amd64/tmp/usr/include/c++/v1/__atomic/atomic_flag.h:62:87: note: declared here
   62 |   _LIBCPP_DEPRECATED_ATOMIC_SYNC _LIBCPP_AVAILABILITY_SYNC _LIBCPP_HIDE_FROM_ABI void notify_one() _NOEXCEPT {
      |                                                                                       ^~~~~~~~~~
/tmp/obj/workspace/src/amd64.amd64/tmp/usr/include/c++/v1/__atomic/atomic_flag.h: In function 'void std::__1::atomic_flag_notify_all(atomic_flag*)':
/tmp/obj/workspace/src/amd64.amd64/tmp/usr/include/c++/v1/__atomic/atomic_flag.h:184:18: warning: 'void std::__1::atomic_flag::notify_all()' is deprecated: The C++20 synchronization library has been deprecated prior to C++20. Please update to using -std=c++20 if you need to use these facilities. [-Wdeprecated-declarations]
  184 |   __o->notify_all();
      |   ~~~~~~~~~~~~~~~^~
/tmp/obj/workspace/src/amd64.amd64/tmp/usr/include/c++/v1/__atomic/atomic_flag.h:68:87: note: declared here
   68 |   _LIBCPP_DEPRECATED_ATOMIC_SYNC _LIBCPP_AVAILABILITY_SYNC _LIBCPP_HIDE_FROM_ABI void notify_all() _NOEXCEPT {
      |                                                                                       ^~~~~~~~~~
--- all_subdir_rescue ---
--- .depend ---
echo shutdown.full: /tmp/obj/workspace/src/amd64.amd64/tmp/usr/lib/libc.a  >> .depend
--- all_subdir_tests ---
--- all_subdir_tests/sys/capsicum ---
--- mini-me ---
--- mini-me.full ---
/usr/local/bin/x86_64-unknown-freebsd14.2-gcc13 --sysroot=/tmp/obj/workspace/src/amd64.amd64/tmp -B/usr/local/x86_64-unknown-freebsd14.2/bin/ -O2 -pipe -fno-common -I/workspace/src/tests -g -std=gnu17 -Wno-format-zero-length -fstack-protector-strong -Wsystem-headers -Werror -Wall -Wno-format-y2k -W -Wno-unused-parameter -Wmissing-prototypes -Wpointer-arith -Wreturn-type -Wcast-qual -Wwrite-strings -Wswitch -Wshadow -Wunused-parameter -Wcast-align -Wchar-subscripts -Wnested-externs -Wold-style-definition -Wno-pointer-sign -Wdate-time -Wno-error=address -Wno-error=array-bounds -Wno-error=attributes -Wno-error=bool-compare -Wno-error=cast-align -Wno-error=clobbered -Wno-error=deprecated-declarations -Wno-error=enum-compare -Wno-error=extra -Wno-error=logical-not-parentheses -Wno-error=strict-aliasing -Wno-error=uninitialized -Wno-error=unused-function -Wno-error=unused-value -Wno-error=empty-body -Wno-error=maybe-uninitialized -Wno-error=nonnull-compare -Wno-error=shift-negative-value -Wno-error=tautological-compare -Wno-error=unused-const-variable -Wno-error=bool-operation -Wno-error=deprecated -Wno-error=expansion-to-defined -Wno-error=format-overflow -Wno-error=format-truncation -Wno-error=implicit-fallthrough -Wno-error=int-in-bool-context -Wno-error=memset-elt-size -Wno-error=noexcept-type -Wno-error=nonnull -Wno-error=pointer-compare -Wno-error=stringop-overflow -Wno-error=aggressive-loop-optimizations -Wno-error=cast-function-type -Wno-error=catch-value -Wno-error=multistatement-macros -Wno-error=restrict -Wno-error=sizeof-pointer-memaccess -Wno-error=stringop-truncation -Wno-return-type  -Wl,-zrelro -static -Wl,-znoexecstack  -o mini-me.full mini-me.o  
--- all_subdir_lib ---
--- .depend.tan_test ---
echo tan_test.full: /tmp/obj/workspace/src/amd64.amd64/tmp/usr/lib/libc.a /tmp/obj/workspace/src/amd64.amd64/tmp/usr/lib/libprivateatf-c.a /tmp/obj/workspace/src/amd64.amd64/tmp/usr/lib/libm.a /tmp/obj/workspace/src/amd64.amd64/lib/libnetbsd/libnetbsd_pie.a >> .depend.tan_test
--- t_tan.pieo ---
--- all_subdir_tests ---
--- all_subdir_tests/sys/cddl ---
--- chg_usr_exec.full ---
--- all_subdir_lib ---
/usr/local/bin/x86_64-unknown-freebsd14.2-gcc13 --sysroot=/tmp/obj/workspace/src/amd64.amd64/tmp -B/usr/local/x86_64-unknown-freebsd14.2/bin/ -fpie -DPIC   -O2 -pipe -fno-common   -DHAVE_FENV_H -I/workspace/src/contrib/netbsd-tests/lib/libc/gen -D__HAVE_LONG_DOUBLE -fno-builtin -DLDBL_PREC=64 -I/workspace/src/lib/libnetbsd -I/workspace/src/contrib/netbsd-tests -fPIE -g -MD  -MF.depend.tan_test.t_tan.pieo -MTt_tan.pieo -std=gnu17 -Wno-format-zero-length -fstack-protector-strong -Wsystem-headers -Werror -Wall -Wno-format-y2k -W -Wno-unused-parameter -Wmissing-prototypes -Wpointer-arith -Wreturn-type -Wcast-qual -Wwrite-strings -Wswitch -Wshadow -Wunused-parameter -Wcast-align -Wchar-subscripts -Wnested-externs -Wold-style-definition -Wno-pointer-sign -Wdate-time -Wno-error=address -Wno-error=array-bounds -Wno-error=attributes -Wno-error=bool-compare -Wno-error=cast-align -Wno-error=clobbered -Wno-error=deprecated-declarations -Wno-error=enum-compare -Wno-error=extra -Wno-error=logical-not-parentheses -Wno-error=strict-aliasing -Wno-error=uninitialized -Wno-error=unused-function -Wno-error=unused-value -Wno-error=empty-body -Wno-error=maybe-uninitialized -Wno-error=nonnull-compare -Wno-error=shift-negative-value -Wno-error=tautological-compare -Wno-error=unused-const-variable -Wno-error=bool-operation -Wno-error=deprecated -Wno-error=expansion-to-defined -Wno-error=format-overflow -Wno-error=format-truncation -Wno-error=implicit-fallthrough -Wno-error=int-in-bool-context -Wno-error=memset-elt-size -Wno-error=noexcept-type -Wno-error=nonnull -Wno-error=pointer-compare -Wno-error=stringop-overflow -Wno-error=aggressive-loop-optimizations -Wno-error=cast-function-type -Wno-error=catch-value -Wno-error=multistatement-macros -Wno-error=restrict -Wno-error=sizeof-pointer-memaccess -Wno-error=stringop-truncation -Wno-return-type -Wno-unknown-pragmas       -c /workspace/src/contrib/netbsd-tests/lib/libm/t_tan.c -o t_tan.pieo
--- all_subdir_usr.bin ---
In file included from /tmp/obj/workspace/src/amd64.amd64/tmp/usr/include/c++/v1/iterator:742,
                 from /tmp/obj/workspace/src/amd64.amd64/tmp/usr/include/c++/v1/optional:1292:
/tmp/obj/workspace/src/amd64.amd64/tmp/usr/include/c++/v1/variant: In member function 'void std::__1::__variant_detail::__assignment<_Traits>::__assign_alt(std::__1::__variant_detail::__alt<_Ip, _Tp>&, _Arg&&)':
/tmp/obj/workspace/src/amd64.amd64/tmp/usr/include/c++/v1/variant:931:81: warning: 'visibility' attribute ignored [-Wattributes]
  931 |         _LIBCPP_HIDDEN _LIBCPP_CONSTEXPR_SINCE_CXX20 void operator()(true_type) const {
      |                                                                                 ^~~~~
/tmp/obj/workspace/src/amd64.amd64/tmp/usr/include/c++/v1/variant:934:82: warning: 'visibility' attribute ignored [-Wattributes]
  934 |         _LIBCPP_HIDDEN _LIBCPP_CONSTEXPR_SINCE_CXX20 void operator()(false_type) const {
      |                                                                                  ^~~~~
--- all_subdir_tests ---
/usr/local/bin/x86_64-unknown-freebsd14.2-gcc13 --sysroot=/tmp/obj/workspace/src/amd64.amd64/tmp -B/usr/local/x86_64-unknown-freebsd14.2/bin/ -O2 -pipe -fno-common -fPIE -g -std=gnu17 -Wno-format-zero-length -fstack-protector-strong -Wno-pointer-sign -Wdate-time -Wno-error=address -Wno-error=array-bounds -Wno-error=attributes -Wno-error=bool-compare -Wno-error=cast-align -Wno-error=clobbered -Wno-error=deprecated-declarations -Wno-error=enum-compare -Wno-error=extra -Wno-error=logical-not-parentheses -Wno-error=strict-aliasing -Wno-error=uninitialized -Wno-error=unused-function -Wno-error=unused-value -Wno-error=empty-body -Wno-error=maybe-uninitialized -Wno-error=nonnull-compare -Wno-error=shift-negative-value -Wno-error=tautological-compare -Wno-error=unused-const-variable -Wno-error=bool-operation -Wno-error=deprecated -Wno-error=expansion-to-defined -Wno-error=format-overflow -Wno-error=format-truncation -Wno-error=implicit-fallthrough -Wno-error=int-in-bool-context -Wno-error=memset-elt-size -Wno-error=noexcept-type -Wno-error=nonnull -Wno-error=pointer-compare -Wno-error=stringop-overflow -Wno-error=aggressive-loop-optimizations -Wno-error=cast-function-type -Wno-error=catch-value -Wno-error=multistatement-macros -Wno-error=restrict -Wno-error=sizeof-pointer-memaccess -Wno-error=stringop-truncation -Wno-return-type -Wno-address-of-packed-member  -Wl,-zrelro -pie -Wl,-znoexecstack  -o chg_usr_exec.full chg_usr_exec.pieo  
--- all_subdir_rescue ---
--- shutdown.o ---
/usr/local/bin/x86_64-unknown-freebsd14.2-gcc13 --sysroot=/tmp/obj/workspace/src/amd64.amd64/tmp -B/usr/local/x86_64-unknown-freebsd14.2/bin/  -O2 -pipe -fno-common   -DRESCUE -I/tmp/obj/workspace/src/amd64.amd64/lib/libifconfig -I/tmp/obj/workspace/src/amd64.amd64/lib/libiscsiutil -g -MD  -MF.depend.shutdown.o -MTshutdown.o -std=gnu17 -Wno-format-zero-length -fstack-protector-strong -Wsystem-headers -Werror -Wall -Wno-format-y2k -W -Wno-unused-parameter -Wmissing-prototypes -Wpointer-arith -Wreturn-type -Wcast-qual -Wwrite-strings -Wswitch -Wshadow -Wunused-parameter -Wcast-align -Wchar-subscripts -Wnested-externs -Wold-style-definition -Wno-pointer-sign -Wdate-time -Wno-error=address -Wno-error=array-bounds -Wno-error=attributes -Wno-error=bool-compare -Wno-error=cast-align -Wno-error=clobbered -Wno-error=deprecated-declarations -Wno-error=enum-compare -Wno-error=extra -Wno-error=logical-not-parentheses -Wno-error=strict-aliasing -Wno-error=uninitialized -Wno-error=unused-function -Wno-error=unused-value -Wno-error=empty-body -Wno-error=maybe-uninitialized -Wno-error=nonnull-compare -Wno-error=shift-negative-value -Wno-error=tautological-compare -Wno-error=unused-const-variable -Wno-error=bool-operation -Wno-error=deprecated -Wno-error=expansion-to-defined -Wno-error=format-overflow -Wno-error=format-truncation -Wno-error=implicit-fallthrough -Wno-error=int-in-bool-context -Wno-error=memset-elt-size -Wno-error=noexcept-type -Wno-error=nonnull -Wno-error=pointer-compare -Wno-error=stringop-overflow -Wno-error=aggressive-loop-optimizations -Wno-error=cast-function-type -Wno-error=catch-value -Wno-error=multistatement-macros -Wno-error=restrict -Wno-error=sizeof-pointer-memaccess -Wno-error=stringop-truncation -Wno-return-type        -c /workspace/src/sbin/shutdown/shutdown.c -o shutdown.o
--- all_subdir_tests ---
--- chg_usr_exec.debug ---
--- all_subdir_usr.bin ---
In file included from /tmp/obj/workspace/src/amd64.amd64/tmp/usr/include/c++/v1/__memory/shared_ptr.h:32,
                 from /tmp/obj/workspace/src/amd64.amd64/tmp/usr/include/c++/v1/__memory/inout_ptr.h:16,
                 from /tmp/obj/workspace/src/amd64.amd64/tmp/usr/include/c++/v1/memory:944,
                 from /tmp/obj/workspace/src/amd64.amd64/tmp/usr/include/c++/v1/optional:1294:
/tmp/obj/workspace/src/amd64.amd64/tmp/usr/include/c++/v1/__memory/unique_ptr.h: At global scope:
/tmp/obj/workspace/src/amd64.amd64/tmp/usr/include/c++/v1/__memory/unique_ptr.h:669:29: warning: type attributes ignored after type is already defined [-Wattributes]
  669 | struct _LIBCPP_TEMPLATE_VIS hash;
      |                             ^~~~
--- all_subdir_tests ---
/usr/local/x86_64-unknown-freebsd14.2/bin/objcopy --only-keep-debug chg_usr_exec.full chg_usr_exec.debug
--- chg_usr_exec ---
/usr/local/x86_64-unknown-freebsd14.2/bin/objcopy --strip-debug --add-gnu-debuglink=chg_usr_exec.debug  chg_usr_exec.full chg_usr_exec
--- dir_rd_update ---
(cd /workspace/src/tests/sys/cddl/zfs/bin &&  DEPENDFILE=.depend.dir_rd_update  NO_SUBDIR=1 make -f /workspace/src/tests/sys/cddl/zfs/bin/Makefile _RECURSING_PROGS=t  PROG=dir_rd_update )
--- .depend.dir_rd_update ---
echo dir_rd_update.full: /tmp/obj/workspace/src/amd64.amd64/tmp/usr/lib/libc.a  >> .depend.dir_rd_update
--- dir_rd_update.pieo ---
/usr/local/bin/x86_64-unknown-freebsd14.2-gcc13 --sysroot=/tmp/obj/workspace/src/amd64.amd64/tmp -B/usr/local/x86_64-unknown-freebsd14.2/bin/ -fpie -DPIC   -O2 -pipe -fno-common   -fPIE -g -MD  -MF.depend.dir_rd_update.dir_rd_update.pieo -MTdir_rd_update.pieo -std=gnu17 -Wno-format-zero-length -fstack-protector-strong -Wno-pointer-sign -Wdate-time -Wno-error=address -Wno-error=array-bounds -Wno-error=attributes -Wno-error=bool-compare -Wno-error=cast-align -Wno-error=clobbered -Wno-error=deprecated-declarations -Wno-error=enum-compare -Wno-error=extra -Wno-error=logical-not-parentheses -Wno-error=strict-aliasing -Wno-error=uninitialized -Wno-error=unused-function -Wno-error=unused-value -Wno-error=empty-body -Wno-error=maybe-uninitialized -Wno-error=nonnull-compare -Wno-error=shift-negative-value -Wno-error=tautological-compare -Wno-error=unused-const-variable -Wno-error=bool-operation -Wno-error=deprecated -Wno-error=expansion-to-defined -Wno-error=format-overflow -Wno-error=format-truncation -Wno-error=implicit-fallthrough -Wno-error=int-in-bool-context -Wno-error=memset-elt-size -Wno-error=noexcept-type -Wno-error=nonnull -Wno-error=pointer-compare -Wno-error=stringop-overflow -Wno-error=aggressive-loop-optimizations -Wno-error=cast-function-type -Wno-error=catch-value -Wno-error=multistatement-macros -Wno-error=restrict -Wno-error=sizeof-pointer-memaccess -Wno-error=stringop-truncation -Wno-return-type -Wno-address-of-packed-member      -c /workspace/src/tests/sys/cddl/zfs/bin/dir_rd_update.c -o dir_rd_update.pieo
--- all_subdir_lib ---
--- all_subdir_lib/libc ---
--- h_dns_server.full ---
/usr/local/bin/x86_64-unknown-freebsd14.2-gcc13 --sysroot=/tmp/obj/workspace/src/amd64.amd64/tmp -B/usr/local/x86_64-unknown-freebsd14.2/bin/ -O2 -pipe -fno-common -I/workspace/src/lib/libc/tests/net -fPIE -g -std=gnu17 -Wno-format-zero-length -fstack-protector-strong -Wsystem-headers -Werror -Wall -Wno-format-y2k -Wno-uninitialized -Wno-pointer-sign -Wdate-time -Wno-error=address -Wno-error=array-bounds -Wno-error=attributes -Wno-error=bool-compare -Wno-error=cast-align -Wno-error=clobbered -Wno-error=deprecated-declarations -Wno-error=enum-compare -Wno-error=extra -Wno-error=logical-not-parentheses -Wno-error=strict-aliasing -Wno-error=uninitialized -Wno-error=unused-function -Wno-error=unused-value -Wno-error=empty-body -Wno-error=maybe-uninitialized -Wno-error=nonnull-compare -Wno-error=shift-negative-value -Wno-error=tautological-compare -Wno-error=unused-const-variable -Wno-error=bool-operation -Wno-error=deprecated -Wno-error=expansion-to-defined -Wno-error=format-overflow -Wno-error=format-truncation -Wno-error=implicit-fallthrough -Wno-error=int-in-bool-context -Wno-error=memset-elt-size -Wno-error=noexcept-type -Wno-error=nonnull -Wno-error=pointer-compare -Wno-error=stringop-overflow -Wno-error=aggressive-loop-optimizations -Wno-error=cast-function-type -Wno-error=catch-value -Wno-error=multistatement-macros -Wno-error=restrict -Wno-error=sizeof-pointer-memaccess -Wno-error=stringop-truncation -Wno-return-type -Wno-address-of-packed-member  -Wl,-zrelro -pie -Wl,-znoexecstack  -o h_dns_server.full h_dns_server.pieo  
--- all_subdir_tests ---
--- all_subdir_tests/sys/capsicum ---
--- mini-me.noexec ---
/usr/local/bin/x86_64-unknown-freebsd14.2-ld: /tmp/obj/workspace/src/amd64.amd64/tmp/usr/lib/crt1.o: in function `_start':
--- all_subdir_usr.bin ---
/tmp/obj/workspace/src/amd64.amd64/tmp/usr/include/c++/v1/__memory/shared_ptr.h:1568:29: warning: type attributes ignored after type is already defined [-Wattributes]
 1568 | struct _LIBCPP_TEMPLATE_VIS hash;
      |                             ^~~~
--- all_subdir_lib ---
--- h_dns_server.debug ---
--- all_subdir_tests ---
/workspace/src/lib/csu/amd64/crt1_s.S:66:(.text+0x17): undefined reference to `main'
--- all_subdir_tests/sys/cddl ---
--- dir_rd_update.full ---
--- all_subdir_lib ---
/usr/local/x86_64-unknown-freebsd14.2/bin/objcopy --only-keep-debug h_dns_server.full h_dns_server.debug
--- h_dns_server ---
/usr/local/x86_64-unknown-freebsd14.2/bin/objcopy --strip-debug --add-gnu-debuglink=h_dns_server.debug  h_dns_server.full h_dns_server
--- ether_test ---
(cd /workspace/src/lib/libc/tests/net &&  DEPENDFILE=.depend.ether_test  NO_SUBDIR=1 make -f /workspace/src/lib/libc/tests/net/Makefile _RECURSING_PROGS=t  PROG=ether_test )
--- all_subdir_tests ---
/usr/local/bin/x86_64-unknown-freebsd14.2-gcc13 --sysroot=/tmp/obj/workspace/src/amd64.amd64/tmp -B/usr/local/x86_64-unknown-freebsd14.2/bin/ -O2 -pipe -fno-common -fPIE -g -std=gnu17 -Wno-format-zero-length -fstack-protector-strong -Wno-pointer-sign -Wdate-time -Wno-error=address -Wno-error=array-bounds -Wno-error=attributes -Wno-error=bool-compare -Wno-error=cast-align -Wno-error=clobbered -Wno-error=deprecated-declarations -Wno-error=enum-compare -Wno-error=extra -Wno-error=logical-not-parentheses -Wno-error=strict-aliasing -Wno-error=uninitialized -Wno-error=unused-function -Wno-error=unused-value -Wno-error=empty-body -Wno-error=maybe-uninitialized -Wno-error=nonnull-compare -Wno-error=shift-negative-value -Wno-error=tautological-compare -Wno-error=unused-const-variable -Wno-error=bool-operation -Wno-error=deprecated -Wno-error=expansion-to-defined -Wno-error=format-overflow -Wno-error=format-truncation -Wno-error=implicit-fallthrough -Wno-error=int-in-bool-context -Wno-error=memset-elt-size -Wno-error=noexcept-type -Wno-error=nonnull -Wno-error=pointer-compare -Wno-error=stringop-overflow -Wno-error=aggressive-loop-optimizations -Wno-error=cast-function-type -Wno-error=catch-value -Wno-error=multistatement-macros -Wno-error=restrict -Wno-error=sizeof-pointer-memaccess -Wno-error=stringop-truncation -Wno-return-type -Wno-address-of-packed-member  -Wl,-zrelro -pie -Wl,-znoexecstack  -o dir_rd_update.full dir_rd_update.pieo  
--- all_subdir_lib ---
--- all_subdir_lib/libc/tests/gen ---
--- wordexp_test.full ---
--- all_subdir_lib/libc/tests/net ---
--- .depend.ether_test ---
--- all_subdir_tests ---
--- all_subdir_tests/sys/capsicum ---
collect2: error: ld returned 1 exit status
*** [mini-me.noexec.full] Error code 1

make[6]: stopped in /workspace/src/tests/sys/capsicum
--- all_subdir_lib ---
--- all_subdir_lib/msun ---

make[4]: stopped in /workspace/src/lib/msun

make[3]: stopped in /workspace/src/lib
--- all_subdir_cddl ---

make[5]: stopped in /workspace/src/cddl/usr.sbin/zfsd
--- all_subdir_lib ---
--- all_subdir_lib/libc ---

make[3]: stopped in /workspace/src/lib

make[2]: stopped in /workspace/src
--- all_subdir_cddl ---

make[4]: stopped in /workspace/src/cddl/usr.sbin
--- all_subdir_usr.sbin ---

make[2]: stopped in /workspace/src
--- all_subdir_rescue ---
*** [objs] Error code 6

make[4]: stopped in /workspace/src/rescue/rescue
1 error

make[4]: stopped in /workspace/src/rescue/rescue
--- all_subdir_cddl ---

make[3]: stopped in /workspace/src/cddl
--- all_subdir_rescue ---

make[3]: stopped in /workspace/src/rescue
--- all_subdir_cddl ---

make[2]: stopped in /workspace/src
--- all_subdir_rescue ---

make[2]: stopped in /workspace/src
--- all_subdir_sbin ---

make[2]: stopped in /workspace/src
--- all_subdir_tests ---

make[4]: stopped in /workspace/src/tests/sys
--- all_subdir_tests/sys/audit ---

make[4]: stopped in /workspace/src/tests/sys
--- all_subdir_tests/sys/cddl ---

make[4]: stopped in /workspace/src/tests/sys

make[3]: stopped in /workspace/src/tests

make[2]: stopped in /workspace/src
--- all_subdir_usr.bin ---

make[2]: stopped in /workspace/src
       99.10 real       973.15 user       107.12 sys

make[1]: stopped in /workspace/src

make: stopped in /workspace/src
Build step 'Execute shell' marked build as failure
[WARNINGS]Skipping publisher since build result is FAILURE
[PostBuildScript] - [INFO] Executing post build scripts.
[FreeBSD-main-amd64-gcc13_build] $ /bin/sh -xe /tmp/jenkins18333561640227454443.sh
+ sh freebsd-ci/scripts/jail/clean.sh
clean jail FreeBSD-main-amd64-gcc13_build
Checking for post-build
Performing post-build step
Checking if email needs to be generated
Email was triggered for: Failure - Any
Sending email for trigger: Failure - Any
Sending mail from default account using System Admin e-mail address