FreeBSD-stable-15-amd64-test - Build #159 - Still Unstable
Date: Thu, 30 Oct 2025 21:38:17 UTC
FreeBSD-stable-15-amd64-test - Build #159 (725ab10063fe61c07fb37faa1309a7ac1deaa032) - Still Unstable
Build information: https://ci.FreeBSD.org/job/FreeBSD-stable-15-amd64-test/159/
Full change log: https://ci.FreeBSD.org/job/FreeBSD-stable-15-amd64-test/159/changes
Full build log: https://ci.FreeBSD.org/job/FreeBSD-stable-15-amd64-test/159/console
Status explanation:
"Unstable" - some tests are suspected being broken by the following changes
"Still Unstable" - the failing test cases have not been fixed by these
following changes and this is a notification to note that
these changes have not been fully tested by the CI system
Change summaries:
(Those commits are likely but not certainly responsible)
No changes
The failed test cases:
11 tests failed.
FAILED: sys.netpfil.pf.pflog.rdr_action
Error Message:
atf-check failed; see the output of the test for details
FAILED: sbin.ipfw.test_add_rule.py.TestAddRule::test_add_action[call_420]
Error Message:
/usr/tests/atf_python/sys/netpfil/ipfw/insns.py:105: ValueError
FAILED: sbin.ipfw.test_add_rule.py.TestAddRule::test_add_action[return]
Error Message:
/usr/tests/atf_python/sys/netpfil/ipfw/insns.py:105: ValueError
FAILED: sbin.ipfw.test_add_rule.py.TestAddRule::test_add_action[skipto_42]
Error Message:
/usr/tests/atf_python/sys/netpfil/ipfw/insns.py:105: ValueError
FAILED: sbin.ipfw.test_add_rule.py.TestAddRule::test_add_rule[test_check_state]
Error Message:
/usr/tests/atf_python/sys/netpfil/ipfw/insns.py:105: ValueError
FAILED: sbin.ipfw.test_add_rule.py.TestAddRule::test_add_rule[test_eaction_ntp]
Error Message:
/usr/tests/sbin/ipfw/test_add_rule.py:119: AssertionError
FAILED: sbin.ipfw.test_add_rule.py.TestAddRule::test_add_rule[test_eaction_tcp-setmss]
Error Message:
/usr/tests/sbin/ipfw/test_add_rule.py:119: AssertionError
FAILED: sbin.ipfw.test_add_rule.py.TestAddRule::test_add_rule[test_keep_state]
Error Message:
/usr/tests/atf_python/sys/netpfil/ipfw/insns.py:105: ValueError
FAILED: sbin.ipfw.test_add_rule.py.TestAddRule::test_add_rule[test_record_state]
Error Message:
/usr/tests/atf_python/sys/netpfil/ipfw/insns.py:105: ValueError
FAILED: sbin.ipfw.test_add_rule.py.TestAddRule::test_add_rule[test_tables]
Error Message:
/usr/tests/sbin/ipfw/test_add_rule.py:119: AssertionError
FAILED: sys.netlink.test_netlink_message_writer.py.__test_cases_list__
Error Message:
Test program did not exit cleanly