FreeBSD-main-amd64-test - Build #27047 - Still Unstable
Date: Sun, 26 Oct 2025 07:04:01 UTC
FreeBSD-main-amd64-test - Build #27047 (28e52dea96809c7904e498759ee1f79bda929a82) - Still Unstable
Build information: https://ci.FreeBSD.org/job/FreeBSD-main-amd64-test/27047/
Full change log: https://ci.FreeBSD.org/job/FreeBSD-main-amd64-test/27047/changes
Full build log: https://ci.FreeBSD.org/job/FreeBSD-main-amd64-test/27047/console
Status explanation:
"Unstable" - some tests are suspected being broken by the following changes
"Still Unstable" - the failing test cases have not been fixed by these
following changes and this is a notification to note that
these changes have not been fully tested by the CI system
Change summaries:
(Those commits are likely but not certainly responsible)
28e52dea96809c7904e498759ee1f79bda929a82 by emaste:
ipfw: Remove IP_DUMMYNET_GET case
The failed test cases:
3 tests failed.
FAILED: sys.netlink.test_rtnl_neigh.py.TestRtNlNeigh::test_6_filter_iface
Error Message:
Test case body timed out
FAILED: sys.netpfil.pf.mbuf.inet6_in_mbuf_len
Error Message:
atf-check failed; see the output of the test for details
FAILED: sys.net.if_tun_test.transient
Error Message:
Test case body timed out