FreeBSD-main-amd64-test - Build #27010 - Still Unstable
Date: Thu, 16 Oct 2025 22:22:27 UTC
FreeBSD-main-amd64-test - Build #27010 (d970d0246fdd70f65db7226104071330c83e27bd) - Still Unstable
Build information: https://ci.FreeBSD.org/job/FreeBSD-main-amd64-test/27010/
Full change log: https://ci.FreeBSD.org/job/FreeBSD-main-amd64-test/27010/changes
Full build log: https://ci.FreeBSD.org/job/FreeBSD-main-amd64-test/27010/console
Status explanation:
"Unstable" - some tests are suspected being broken by the following changes
"Still Unstable" - the failing test cases have not been fixed by these
following changes and this is a notification to note that
these changes have not been fully tested by the CI system
Change summaries:
(Those commits are likely but not certainly responsible)
d970d0246fdd70f65db7226104071330c83e27bd by andrew:
arm64: Move BP hardening and SSBD workaround to CPU_FEAT framework
The failed test cases:
10 tests failed.
FAILED: lib.libc.regex.exhaust_test.regcomp_too_big
Error Message:
Empty test result or no new line
FAILED: sys.geom.class.multipath.misc.add
Error Message:
ACTIVE != (ACTIVE != )
FAILED: sys.geom.class.multipath.misc.create_A
Error Message:
ACTIVE != (ACTIVE != )
FAILED: sys.geom.class.multipath.misc.create_R
Error Message:
ACTIVE != (ACTIVE != )
FAILED: sys.geom.class.multipath.misc.fail
Error Message:
ACTIVE != (ACTIVE != )
FAILED: sys.geom.class.multipath.misc.fail_on_error
Error Message:
FAIL != (FAIL != )
FAILED: sys.geom.class.multipath.misc.prefer
Error Message:
ACTIVE != (ACTIVE != )
FAILED: sys.geom.class.multipath.misc.restore
Error Message:
FAIL != (FAIL != )
FAILED: sys.geom.class.multipath.misc.restore_on_error
Error Message:
ACTIVE != (ACTIVE != )
FAILED: sys.geom.class.multipath.misc.rotate
Error Message:
ACTIVE != (ACTIVE != )