FreeBSD-main-amd64-test - Build #27004 - Still Unstable
Date: Thu, 16 Oct 2025 04:01:31 UTC
FreeBSD-main-amd64-test - Build #27004 (8596810d02a1e361e0312d116339aa106aca4b19) - Still Unstable
Build information: https://ci.FreeBSD.org/job/FreeBSD-main-amd64-test/27004/
Full change log: https://ci.FreeBSD.org/job/FreeBSD-main-amd64-test/27004/changes
Full build log: https://ci.FreeBSD.org/job/FreeBSD-main-amd64-test/27004/console
Status explanation:
"Unstable" - some tests are suspected being broken by the following changes
"Still Unstable" - the failing test cases have not been fixed by these
following changes and this is a notification to note that
these changes have not been fully tested by the CI system
Change summaries:
(Those commits are likely but not certainly responsible)
be7bdb1cf0b0f665bcd57c03fde41bd6c01d8ead by glebius:
netinet: do route lookup when asked to join multicast group on ifindex 0
479e29157259086c40eb61b1326299c22de5a59c by glebius:
linux: make linux_to_bsd_sockaddr() use memory supplied by caller
47b2732650252a1d31b25f6008aaa42e963eb8c1 by glebius:
linux: add translation for MCAST_JOIN_GROUP family of socket options
8596810d02a1e361e0312d116339aa106aca4b19 by glebius:
tests/carp: kill routed(8) before destroying interfaces
The failed test cases:
11 tests failed.
FAILED: lib.libc.regex.exhaust_test.regcomp_too_big
Error Message:
Empty test result or no new line
FAILED: lib.libregex.exhaust_test.regcomp_too_big
Error Message:
Empty test result or no new line
FAILED: sys.geom.class.multipath.misc.add
Error Message:
ACTIVE != (ACTIVE != )
FAILED: sys.geom.class.multipath.misc.create_A
Error Message:
ACTIVE != (ACTIVE != )
FAILED: sys.geom.class.multipath.misc.create_R
Error Message:
ACTIVE != (ACTIVE != )
FAILED: sys.geom.class.multipath.misc.fail
Error Message:
ACTIVE != (ACTIVE != )
FAILED: sys.geom.class.multipath.misc.fail_on_error
Error Message:
FAIL != (FAIL != )
FAILED: sys.geom.class.multipath.misc.prefer
Error Message:
ACTIVE != (ACTIVE != )
FAILED: sys.geom.class.multipath.misc.restore
Error Message:
FAIL != (FAIL != )
FAILED: sys.geom.class.multipath.misc.restore_on_error
Error Message:
ACTIVE != (ACTIVE != )
FAILED: sys.geom.class.multipath.misc.rotate
Error Message:
ACTIVE != (ACTIVE != )