FreeBSD-stable-15-amd64-test - Build #76 - Still Unstable

From: <jenkins-admin_at_FreeBSD.org>
Date: Wed, 15 Oct 2025 22:40:13 UTC
FreeBSD-stable-15-amd64-test - Build #76 (bbfaff26bf365126cb4d38fda99a2100a256d9bd) - Still Unstable

Build information: https://ci.FreeBSD.org/job/FreeBSD-stable-15-amd64-test/76/
Full change log: https://ci.FreeBSD.org/job/FreeBSD-stable-15-amd64-test/76/changes
Full build log: https://ci.FreeBSD.org/job/FreeBSD-stable-15-amd64-test/76/console

Status explanation:
"Unstable" - some tests are suspected being broken by the following changes
"Still Unstable" - the failing test cases have not been fixed by these
                   following changes and this is a notification to note that
                   these changes have not been fully tested by the CI system

Change summaries:
(Those commits are likely but not certainly responsible)

794299ac6876ecdf62e503d3fb05bd388f5c8be7 by glebius:
netlink: in snl_init_writer() don't overwrite error in case of failure

a091d6919c3175f2385719e7b1c6fbd8576134f9 by glebius:
socket(2): refactor the manual page

bbfaff26bf365126cb4d38fda99a2100a256d9bd by glebius:
unix/stream: repair SO_SNDTIMEO



The failed test cases:

10 tests failed.
FAILED:  sbin.ipfw.test_add_rule.py.TestAddRule::test_add_action[call_420]

Error Message:
/usr/tests/atf_python/sys/netpfil/ipfw/insns.py:105: ValueError

FAILED:  sbin.ipfw.test_add_rule.py.TestAddRule::test_add_action[return]

Error Message:
/usr/tests/atf_python/sys/netpfil/ipfw/insns.py:105: ValueError

FAILED:  sbin.ipfw.test_add_rule.py.TestAddRule::test_add_action[skipto_42]

Error Message:
/usr/tests/atf_python/sys/netpfil/ipfw/insns.py:105: ValueError

FAILED:  sbin.ipfw.test_add_rule.py.TestAddRule::test_add_rule[test_check_state]

Error Message:
/usr/tests/atf_python/sys/netpfil/ipfw/insns.py:105: ValueError

FAILED:  sbin.ipfw.test_add_rule.py.TestAddRule::test_add_rule[test_eaction_ntp]

Error Message:
/usr/tests/sbin/ipfw/test_add_rule.py:119: AssertionError

FAILED:  sbin.ipfw.test_add_rule.py.TestAddRule::test_add_rule[test_eaction_tcp-setmss]

Error Message:
/usr/tests/sbin/ipfw/test_add_rule.py:119: AssertionError

FAILED:  sbin.ipfw.test_add_rule.py.TestAddRule::test_add_rule[test_keep_state]

Error Message:
/usr/tests/atf_python/sys/netpfil/ipfw/insns.py:105: ValueError

FAILED:  sbin.ipfw.test_add_rule.py.TestAddRule::test_add_rule[test_record_state]

Error Message:
/usr/tests/atf_python/sys/netpfil/ipfw/insns.py:105: ValueError

FAILED:  sbin.ipfw.test_add_rule.py.TestAddRule::test_add_rule[test_tables]

Error Message:
/usr/tests/sbin/ipfw/test_add_rule.py:119: AssertionError

FAILED:  sys.netlink.test_netlink_message_writer.py.__test_cases_list__

Error Message:
Test program did not exit cleanly