FreeBSD-main-amd64-test - Build #27001 - Still Unstable
Date: Wed, 15 Oct 2025 21:05:01 UTC
FreeBSD-main-amd64-test - Build #27001 (2976a7ce2e9b0ba1f59601218583c6330776f401) - Still Unstable
Build information: https://ci.FreeBSD.org/job/FreeBSD-main-amd64-test/27001/
Full change log: https://ci.FreeBSD.org/job/FreeBSD-main-amd64-test/27001/changes
Full build log: https://ci.FreeBSD.org/job/FreeBSD-main-amd64-test/27001/console
Status explanation:
"Unstable" - some tests are suspected being broken by the following changes
"Still Unstable" - the failing test cases have not been fixed by these
following changes and this is a notification to note that
these changes have not been fully tested by the CI system
Change summaries:
(Those commits are likely but not certainly responsible)
2976a7ce2e9b0ba1f59601218583c6330776f401 by emaste:
libpam: Add newline at EOF in modules.inc
The failed test cases:
9 tests failed.
FAILED: sys.geom.class.multipath.misc.add
Error Message:
ACTIVE != (ACTIVE != )
FAILED: sys.geom.class.multipath.misc.create_A
Error Message:
ACTIVE != (ACTIVE != )
FAILED: sys.geom.class.multipath.misc.create_R
Error Message:
ACTIVE != (ACTIVE != )
FAILED: sys.geom.class.multipath.misc.fail
Error Message:
ACTIVE != (ACTIVE != )
FAILED: sys.geom.class.multipath.misc.fail_on_error
Error Message:
FAIL != (FAIL != )
FAILED: sys.geom.class.multipath.misc.prefer
Error Message:
ACTIVE != (ACTIVE != )
FAILED: sys.geom.class.multipath.misc.restore
Error Message:
FAIL != (FAIL != )
FAILED: sys.geom.class.multipath.misc.restore_on_error
Error Message:
ACTIVE != (ACTIVE != )
FAILED: sys.geom.class.multipath.misc.rotate
Error Message:
ACTIVE != (ACTIVE != )