FreeBSD-stable-15-amd64-test - Build #74 - Still unstable
Date: Wed, 15 Oct 2025 17:36:28 UTC
FreeBSD-stable-15-amd64-test - Build #74 (25c6697b0b985228639cdeb5212a5f705731f69a) - Still unstable
Build information: https://ci.FreeBSD.org/job/FreeBSD-stable-15-amd64-test/74/
Full change log: https://ci.FreeBSD.org/job/FreeBSD-stable-15-amd64-test/74/changes
Full build log: https://ci.FreeBSD.org/job/FreeBSD-stable-15-amd64-test/74/console
Status explanation:
"Unstable" - some tests are suspected being broken by the following changes
"Still Unstable" - the failing test cases have not been fixed by these
following changes and this is a notification to note that
these changes have not been fully tested by the CI system
Change summaries:
(Those commits are likely but not certainly responsible)
8e957b78e6846c57e70d9c302c027fa02f13bb14 by markj:
rc: Update dependencies for zpool scripts
ead69828206e01ee0cc8f9436def1ea76327377e by markj:
ossl: Add GCM support on powerpc64/powerpc64le (POWER8+)
9bed273477dc8aee1e8bd8da2ae718c9210e7e86 by markj:
tests/mac_portacl: restore sysctls after modification
df64ca1bfcd32b19196c8b99b2b8e78520ef7f7c by markj:
tests/mac_ipacl: restore sysctls after modification
88c0ce38bc18acaf50188eda402384a0cb93890d by markj:
qat: enable qat driver for 402xx device
6d44212c641b9f30e5b9dd6e261659d20f916081 by markj:
pw: pw_mkdb(3) does not set errno
3a382afe367a5ecd849ca0e3ba92781f24ce1be4 by markj:
cryptocheck: Be friendlier when testing software crypto backends
25c6697b0b985228639cdeb5212a5f705731f69a by ae:
ipv6: don't complain when deleting an address with prefix length of 128
The failed test cases:
11 tests failed.
FAILED: lib.libc.regex.exhaust_test.regcomp_too_big
Error Message:
Empty test result or no new line
FAILED: sbin.ipfw.test_add_rule.py.TestAddRule::test_add_action[call_420]
Error Message:
/usr/tests/atf_python/sys/netpfil/ipfw/insns.py:105: ValueError
FAILED: sbin.ipfw.test_add_rule.py.TestAddRule::test_add_action[return]
Error Message:
/usr/tests/atf_python/sys/netpfil/ipfw/insns.py:105: ValueError
FAILED: sbin.ipfw.test_add_rule.py.TestAddRule::test_add_action[skipto_42]
Error Message:
/usr/tests/atf_python/sys/netpfil/ipfw/insns.py:105: ValueError
FAILED: sbin.ipfw.test_add_rule.py.TestAddRule::test_add_rule[test_check_state]
Error Message:
/usr/tests/atf_python/sys/netpfil/ipfw/insns.py:105: ValueError
FAILED: sbin.ipfw.test_add_rule.py.TestAddRule::test_add_rule[test_eaction_ntp]
Error Message:
/usr/tests/sbin/ipfw/test_add_rule.py:119: AssertionError
FAILED: sbin.ipfw.test_add_rule.py.TestAddRule::test_add_rule[test_eaction_tcp-setmss]
Error Message:
/usr/tests/sbin/ipfw/test_add_rule.py:119: AssertionError
FAILED: sbin.ipfw.test_add_rule.py.TestAddRule::test_add_rule[test_keep_state]
Error Message:
/usr/tests/atf_python/sys/netpfil/ipfw/insns.py:105: ValueError
FAILED: sbin.ipfw.test_add_rule.py.TestAddRule::test_add_rule[test_record_state]
Error Message:
/usr/tests/atf_python/sys/netpfil/ipfw/insns.py:105: ValueError
FAILED: sbin.ipfw.test_add_rule.py.TestAddRule::test_add_rule[test_tables]
Error Message:
/usr/tests/sbin/ipfw/test_add_rule.py:119: AssertionError
FAILED: sys.netlink.test_netlink_message_writer.py.__test_cases_list__
Error Message:
Test program did not exit cleanly