FreeBSD-main-amd64-test - Build #26999 - Still Unstable
Date: Wed, 15 Oct 2025 16:33:59 UTC
FreeBSD-main-amd64-test - Build #26999 (bde703e8b6ab3acc73bbb20f1ebe26221f33e9f1) - Still Unstable
Build information: https://ci.FreeBSD.org/job/FreeBSD-main-amd64-test/26999/
Full change log: https://ci.FreeBSD.org/job/FreeBSD-main-amd64-test/26999/changes
Full build log: https://ci.FreeBSD.org/job/FreeBSD-main-amd64-test/26999/console
Status explanation:
"Unstable" - some tests are suspected being broken by the following changes
"Still Unstable" - the failing test cases have not been fixed by these
following changes and this is a notification to note that
these changes have not been fully tested by the CI system
Change summaries:
(Those commits are likely but not certainly responsible)
bf84861460f9287fe9cf66b2cd22fefe8e242a28 by ivy:
packages: Rename unbound to local-unbound
bde703e8b6ab3acc73bbb20f1ebe26221f33e9f1 by ivy:
ncurses: Add an ncurses-lib package
The failed test cases:
9 tests failed.
FAILED: sys.geom.class.multipath.misc.add
Error Message:
ACTIVE != (ACTIVE != )
FAILED: sys.geom.class.multipath.misc.create_A
Error Message:
ACTIVE != (ACTIVE != )
FAILED: sys.geom.class.multipath.misc.create_R
Error Message:
ACTIVE != (ACTIVE != )
FAILED: sys.geom.class.multipath.misc.fail
Error Message:
ACTIVE != (ACTIVE != )
FAILED: sys.geom.class.multipath.misc.fail_on_error
Error Message:
FAIL != (FAIL != )
FAILED: sys.geom.class.multipath.misc.prefer
Error Message:
ACTIVE != (ACTIVE != )
FAILED: sys.geom.class.multipath.misc.restore
Error Message:
FAIL != (FAIL != )
FAILED: sys.geom.class.multipath.misc.restore_on_error
Error Message:
ACTIVE != (ACTIVE != )
FAILED: sys.geom.class.multipath.misc.rotate
Error Message:
ACTIVE != (ACTIVE != )