FreeBSD-main-amd64-gcc13_build - Build #4738 - Failure
- Go to: [ bottom of page ] [ top of archives ] [ this month ]
Date: Wed, 15 Oct 2025 15:58:48 UTC
FreeBSD-main-amd64-gcc13_build - Build #4738 (bde703e8b6ab3acc73bbb20f1ebe26221f33e9f1) - Failure
Build information: https://ci.FreeBSD.org/job/FreeBSD-main-amd64-gcc13_build/4738/
Full change log: https://ci.FreeBSD.org/job/FreeBSD-main-amd64-gcc13_build/4738/changes
Full build log: https://ci.FreeBSD.org/job/FreeBSD-main-amd64-gcc13_build/4738/console
Status explanation:
"Failure" - the build is suspected being broken by the following changes
"Still Failing" - the build has not been fixed by the following changes and
this is a notification to note that these changes have
not been fully tested by the CI system
Change summaries:
(Those commits are likely but not certainly responsible)
bf84861460f9287fe9cf66b2cd22fefe8e242a28 by ivy:
packages: Rename unbound to local-unbound
bde703e8b6ab3acc73bbb20f1ebe26221f33e9f1 by ivy:
ncurses: Add an ncurses-lib package
The end of the build log:
[...truncated 94.40 MiB...]
/usr/local/bin/x86_64-unknown-freebsd14.3-gcc13 --sysroot=/tmp/obj/workspace/src/amd64.amd64/tmp -B/usr/local/x86_64-unknown-freebsd14.3/bin/ -O2 -pipe -fno-common -I/workspace/src/sys -fPIE -g -std=gnu17 -Wno-format-zero-length -fstack-protector-strong -Wsystem-headers -Werror -Wall -Wno-format-y2k -W -Wno-unused-parameter -Wmissing-prototypes -Wpointer-arith -Wreturn-type -Wcast-qual -Wwrite-strings -Wswitch -Wshadow -Wunused-parameter -Wcast-align -Wchar-subscripts -Wnested-externs -Wold-style-definition -Wno-pointer-sign -Wdate-time -Wno-error=address -Wno-error=array-bounds -Wno-error=attributes -Wno-error=bool-compare -Wno-error=cast-align -Wno-error=clobbered -Wno-error=deprecated-declarations -Wno-error=enum-compare -Wno-error=extra -Wno-error=logical-not-parentheses -Wno-error=strict-aliasing -Wno-error=uninitialized -Wno-error=unused-function -Wno-error=unused-value -Wno-error=empty-body -Wno-error=maybe-uninitialized -Wno-error=nonnull-compare -Wno-error=shift-negative-value -Wno-error=tautological-compare -Wno-error=unused-const-variable -Wno-error=bool-operation -Wno-error=deprecated -Wno-error=expansion-to-defined -Wno-error=format-overflow -Wno-error=format-truncation -Wno-error=implicit-fallthrough -Wno-error=int-in-bool-context -Wno-error=memset-elt-size -Wno-error=noexcept-type -Wno-error=nonnull -Wno-error=pointer-compare -Wno-error=stringop-overflow -Wno-error=aggressive-loop-optimizations -Wno-error=cast-function-type -Wno-error=catch-value -Wno-error=multistatement-macros -Wno-error=restrict -Wno-error=sizeof-pointer-memaccess -Wno-error=stringop-truncation -Wno-return-type -Wl,-zrelro -pie -Wl,-znoexecstack -o prout_register_huge_cdb.full prout_register_huge_cdb.pieo -lcam
--- all_subdir_lib ---
--- posix_fallocate_test ---
(cd /workspace/src/lib/libc/tests/sys && DEPENDFILE=.depend.posix_fallocate_test NO_SUBDIR=1 make -f /workspace/src/lib/libc/tests/sys/Makefile _RECURSING_PROGS=t PROG=posix_fallocate_test )
--- all_subdir_usr.bin ---
--- cmp.1.gz ---
gzip -cn /workspace/src/usr.bin/cmp/cmp.1 > cmp.1.gz
--- cmp.debug ---
/usr/local/x86_64-unknown-freebsd14.3/bin/objcopy --only-keep-debug cmp.full cmp.debug
--- cmp ---
/usr/local/x86_64-unknown-freebsd14.3/bin/objcopy --strip-debug --add-gnu-debuglink=cmp.debug cmp.full cmp
--- all_subdir_usr.bin/col ---
===> usr.bin/col (all)
--- all_subdir_tests ---
--- prout_register_huge_cdb.debug ---
--- all_subdir_lib ---
--- .depend.posix_fallocate_test ---
echo posix_fallocate_test.full: /tmp/obj/workspace/src/amd64.amd64/tmp/usr/lib/libc.a /tmp/obj/workspace/src/amd64.amd64/tmp/usr/lib/libprivateatf-c.a /tmp/obj/workspace/src/amd64.amd64/lib/libnetbsd/libnetbsd_pie.a >> .depend.posix_fallocate_test
--- all_subdir_tests ---
/usr/local/x86_64-unknown-freebsd14.3/bin/objcopy --only-keep-debug prout_register_huge_cdb.full prout_register_huge_cdb.debug
--- all_subdir_lib ---
--- t_posix_fallocate.pieo ---
/usr/local/bin/x86_64-unknown-freebsd14.3-gcc13 --sysroot=/tmp/obj/workspace/src/amd64.amd64/tmp -B/usr/local/x86_64-unknown-freebsd14.3/bin/ -fpie -DPIC -O2 -pipe -fno-common -I/workspace/src/lib/libnetbsd -I/workspace/src/contrib/netbsd-tests -fPIE -g -MD -MF.depend.posix_fallocate_test.t_posix_fallocate.pieo -MTt_posix_fallocate.pieo -std=gnu17 -Wno-format-zero-length -fstack-protector-strong -Wsystem-headers -Werror -Wall -Wno-format-y2k -Wno-uninitialized -Wno-pointer-sign -Wdate-time -Wno-error=address -Wno-error=array-bounds -Wno-error=attributes -Wno-error=bool-compare -Wno-error=cast-align -Wno-error=clobbered -Wno-error=deprecated-declarations -Wno-error=enum-compare -Wno-error=extra -Wno-error=logical-not-parentheses -Wno-error=strict-aliasing -Wno-error=uninitialized -Wno-error=unused-function -Wno-error=unused-value -Wno-error=empty-body -Wno-error=maybe-uninitialized -Wno-error=nonnull-compare -Wno-error=shift-negative-value -Wno-error=tautological-compare -Wno-error=unused-const-variable -Wno-error=bool-operation -Wno-error=deprecated -Wno-error=expansion-to-defined -Wno-error=format-overflow -Wno-error=format-truncation -Wno-error=implicit-fallthrough -Wno-error=int-in-bool-context -Wno-error=memset-elt-size -Wno-error=noexcept-type -Wno-error=nonnull -Wno-error=pointer-compare -Wno-error=stringop-overflow -Wno-error=aggressive-loop-optimizations -Wno-error=cast-function-type -Wno-error=catch-value -Wno-error=multistatement-macros -Wno-error=restrict -Wno-error=sizeof-pointer-memaccess -Wno-error=stringop-truncation -Wno-return-type -Wno-address-of-packed-member -c /workspace/src/contrib/netbsd-tests/lib/libc/sys/t_posix_fallocate.c -o t_posix_fallocate.pieo
--- all_subdir_tests ---
--- prout_register_huge_cdb ---
/usr/local/x86_64-unknown-freebsd14.3/bin/objcopy --strip-debug --add-gnu-debuglink=prout_register_huge_cdb.debug prout_register_huge_cdb.full prout_register_huge_cdb
--- all_subdir_usr.bin ---
--- .depend ---
echo col.full: /tmp/obj/workspace/src/amd64.amd64/tmp/usr/lib/libc.a >> .depend
--- col.pieo ---
--- all_subdir_tests ---
--- persist ---
--- all_subdir_usr.bin ---
/usr/local/bin/x86_64-unknown-freebsd14.3-gcc13 --sysroot=/tmp/obj/workspace/src/amd64.amd64/tmp -B/usr/local/x86_64-unknown-freebsd14.3/bin/ -fpie -DPIC -O2 -pipe -fno-common -fPIE -g -MD -MF.depend.col.pieo -MTcol.pieo -std=gnu17 -Wno-format-zero-length -fstack-protector-strong -Wsystem-headers -Werror -Wall -Wno-format-y2k -W -Wno-unused-parameter -Wmissing-prototypes -Wpointer-arith -Wreturn-type -Wcast-qual -Wwrite-strings -Wswitch -Wshadow -Wunused-parameter -Wcast-align -Wchar-subscripts -Wnested-externs -Wold-style-definition -Wno-pointer-sign -Wdate-time -Wno-error=address -Wno-error=array-bounds -Wno-error=attributes -Wno-error=bool-compare -Wno-error=cast-align -Wno-error=clobbered -Wno-error=deprecated-declarations -Wno-error=enum-compare -Wno-error=extra -Wno-error=logical-not-parentheses -Wno-error=strict-aliasing -Wno-error=uninitialized -Wno-error=unused-function -Wno-error=unused-value -Wno-error=empty-body -Wno-error=maybe-uninitialized -Wno-error=nonnull-compare -Wno-error=shift-negative-value -Wno-error=tautological-compare -Wno-error=unused-const-variable -Wno-error=bool-operation -Wno-error=deprecated -Wno-error=expansion-to-defined -Wno-error=format-overflow -Wno-error=format-truncation -Wno-error=implicit-fallthrough -Wno-error=int-in-bool-context -Wno-error=memset-elt-size -Wno-error=noexcept-type -Wno-error=nonnull -Wno-error=pointer-compare -Wno-error=stringop-overflow -Wno-error=aggressive-loop-optimizations -Wno-error=cast-function-type -Wno-error=catch-value -Wno-error=multistatement-macros -Wno-error=restrict -Wno-error=sizeof-pointer-memaccess -Wno-error=stringop-truncation -Wno-return-type -c /workspace/src/usr.bin/col/col.c -o col.pieo
--- all_subdir_tests ---
echo '#! /usr/libexec/atf-sh' > persist.tmp
cat /workspace/src/tests/sys/cam/ctl/persist.sh >>persist.tmp
chmod +x persist.tmp
mv persist.tmp persist
--- prevent ---
echo '#! /usr/libexec/atf-sh' > prevent.tmp
cat /workspace/src/tests/sys/cam/ctl/prevent.sh >>prevent.tmp
chmod +x prevent.tmp
mv prevent.tmp prevent
--- read_buffer ---
echo '#! /usr/libexec/atf-sh' > read_buffer.tmp
cat /workspace/src/tests/sys/cam/ctl/read_buffer.sh >>read_buffer.tmp
chmod +x read_buffer.tmp
mv read_buffer.tmp read_buffer
--- start_stop_unit ---
echo '#! /usr/libexec/atf-sh' > start_stop_unit.tmp
cat /workspace/src/tests/sys/cam/ctl/start_stop_unit.sh >>start_stop_unit.tmp
chmod +x start_stop_unit.tmp
mv start_stop_unit.tmp start_stop_unit
--- Kyuafile ---
--- Kyuafile ---
--- all_subdir_tests/sys/capsicum ---
===> tests/sys/capsicum (all)
--- mini-me.pieo ---
/usr/local/bin/x86_64-unknown-freebsd14.3-gcc13 --sysroot=/tmp/obj/workspace/src/amd64.amd64/tmp -B/usr/local/x86_64-unknown-freebsd14.3/bin/ -fpie -DPIC -O2 -pipe -fno-common -I/workspace/src/tests -fPIE -g -std=gnu17 -Wno-format-zero-length -fstack-protector-strong -Wsystem-headers -Werror -Wall -Wno-format-y2k -W -Wno-unused-parameter -Wmissing-prototypes -Wpointer-arith -Wreturn-type -Wcast-qual -Wwrite-strings -Wswitch -Wshadow -Wunused-parameter -Wcast-align -Wchar-subscripts -Wnested-externs -Wold-style-definition -Wno-pointer-sign -Wdate-time -Wno-error=address -Wno-error=array-bounds -Wno-error=attributes -Wno-error=bool-compare -Wno-error=cast-align -Wno-error=clobbered -Wno-error=deprecated-declarations -Wno-error=enum-compare -Wno-error=extra -Wno-error=logical-not-parentheses -Wno-error=strict-aliasing -Wno-error=uninitialized -Wno-error=unused-function -Wno-error=unused-value -Wno-error=empty-body -Wno-error=maybe-uninitialized -Wno-error=nonnull-compare -Wno-error=shift-negative-value -Wno-error=tautological-compare -Wno-error=unused-const-variable -Wno-error=bool-operation -Wno-error=deprecated -Wno-error=expansion-to-defined -Wno-error=format-overflow -Wno-error=format-truncation -Wno-error=implicit-fallthrough -Wno-error=int-in-bool-context -Wno-error=memset-elt-size -Wno-error=noexcept-type -Wno-error=nonnull -Wno-error=pointer-compare -Wno-error=stringop-overflow -Wno-error=aggressive-loop-optimizations -Wno-error=cast-function-type -Wno-error=catch-value -Wno-error=multistatement-macros -Wno-error=restrict -Wno-error=sizeof-pointer-memaccess -Wno-error=stringop-truncation -Wno-return-type -c /workspace/src/contrib/capsicum-test/mini-me.c -o mini-me.pieo
--- all_subdir_lib ---
--- posix_fallocate_test.full ---
/usr/local/bin/x86_64-unknown-freebsd14.3-gcc13 --sysroot=/tmp/obj/workspace/src/amd64.amd64/tmp -B/usr/local/x86_64-unknown-freebsd14.3/bin/ -O2 -pipe -fno-common -I/workspace/src/lib/libnetbsd -I/workspace/src/contrib/netbsd-tests -fPIE -g -std=gnu17 -Wno-format-zero-length -fstack-protector-strong -Wsystem-headers -Werror -Wall -Wno-format-y2k -Wno-uninitialized -Wno-pointer-sign -Wdate-time -Wno-error=address -Wno-error=array-bounds -Wno-error=attributes -Wno-error=bool-compare -Wno-error=cast-align -Wno-error=clobbered -Wno-error=deprecated-declarations -Wno-error=enum-compare -Wno-error=extra -Wno-error=logical-not-parentheses -Wno-error=strict-aliasing -Wno-error=uninitialized -Wno-error=unused-function -Wno-error=unused-value -Wno-error=empty-body -Wno-error=maybe-uninitialized -Wno-error=nonnull-compare -Wno-error=shift-negative-value -Wno-error=tautological-compare -Wno-error=unused-const-variable -Wno-error=bool-operation -Wno-error=deprecated -Wno-error=expansion-to-defined -Wno-error=format-overflow -Wno-error=format-truncation -Wno-error=implicit-fallthrough -Wno-error=int-in-bool-context -Wno-error=memset-elt-size -Wno-error=noexcept-type -Wno-error=nonnull -Wno-error=pointer-compare -Wno-error=stringop-overflow -Wno-error=aggressive-loop-optimizations -Wno-error=cast-function-type -Wno-error=catch-value -Wno-error=multistatement-macros -Wno-error=restrict -Wno-error=sizeof-pointer-memaccess -Wno-error=stringop-truncation -Wno-return-type -Wno-address-of-packed-member -L/tmp/obj/workspace/src/amd64.amd64/lib/libnetbsd -Wl,-zrelro -pie -Wl,-znoexecstack -o posix_fallocate_test.full t_posix_fallocate.pieo -lprivateatf-c -L/tmp/obj/workspace/src/amd64.amd64/lib/libnetbsd -lnetbsd_pie
--- posix_fallocate_test.debug ---
/usr/local/x86_64-unknown-freebsd14.3/bin/objcopy --only-keep-debug posix_fallocate_test.full posix_fallocate_test.debug
--- all_subdir_usr.sbin ---
--- crontab.1.gz ---
gzip -cn /workspace/src/usr.sbin/cron/crontab/crontab.1 > crontab.1.gz
--- all_subdir_lib ---
--- posix_fallocate_test ---
/usr/local/x86_64-unknown-freebsd14.3/bin/objcopy --strip-debug --add-gnu-debuglink=posix_fallocate_test.debug posix_fallocate_test.full posix_fallocate_test
--- all_subdir_usr.sbin ---
--- crontab.5.gz ---
gzip -cn /workspace/src/usr.sbin/cron/crontab/crontab.5 > crontab.5.gz
--- all_subdir_lib ---
--- revoke_test ---
(cd /workspace/src/lib/libc/tests/sys && DEPENDFILE=.depend.revoke_test NO_SUBDIR=1 make -f /workspace/src/lib/libc/tests/sys/Makefile _RECURSING_PROGS=t PROG=revoke_test )
--- all_subdir_usr.sbin ---
--- crontab.full ---
/usr/local/bin/x86_64-unknown-freebsd14.3-gcc13 --sysroot=/tmp/obj/workspace/src/amd64.amd64/tmp -B/usr/local/x86_64-unknown-freebsd14.3/bin/ -O2 -pipe -fno-common -I/workspace/src/usr.sbin/cron/cron -fPIE -g -std=gnu17 -Wno-format-zero-length -fstack-protector-strong -Wsystem-headers -Werror -Wall -Wno-format-y2k -W -Wno-unused-parameter -Wmissing-prototypes -Wpointer-arith -Wno-uninitialized -Wno-pointer-sign -Wdate-time -Wno-error=address -Wno-error=array-bounds -Wno-error=attributes -Wno-error=bool-compare -Wno-error=cast-align -Wno-error=clobbered -Wno-error=deprecated-declarations -Wno-error=enum-compare -Wno-error=extra -Wno-error=logical-not-parentheses -Wno-error=strict-aliasing -Wno-error=uninitialized -Wno-error=unused-function -Wno-error=unused-value -Wno-error=empty-body -Wno-error=maybe-uninitialized -Wno-error=nonnull-compare -Wno-error=shift-negative-value -Wno-error=tautological-compare -Wno-error=unused-const-variable -Wno-error=bool-operation -Wno-error=deprecated -Wno-error=expansion-to-defined -Wno-error=format-overflow -Wno-error=format-truncation -Wno-error=implicit-fallthrough -Wno-error=int-in-bool-context -Wno-error=memset-elt-size -Wno-error=noexcept-type -Wno-error=nonnull -Wno-error=pointer-compare -Wno-error=stringop-overflow -Wno-error=aggressive-loop-optimizations -Wno-error=cast-function-type -Wno-error=catch-value -Wno-error=multistatement-macros -Wno-error=restrict -Wno-error=sizeof-pointer-memaccess -Wno-error=stringop-truncation -Wno-return-type -Wno-address-of-packed-member -Wl,-zrelro -pie -Wl,-znoexecstack -o crontab.full crontab.pieo -L/tmp/obj/workspace/src/amd64.amd64/usr.sbin/cron/lib -lcron_pie -lmd -lutil
--- all_subdir_tests ---
--- functional ---
echo '#! /usr/libexec/atf-sh' > functional.tmp
cat /workspace/src/tests/sys/capsicum/functional.sh >>functional.tmp
chmod +x functional.tmp
mv functional.tmp functional
--- Kyuafile ---
--- mini-me ---
(cd /workspace/src/tests/sys/capsicum && DEPENDFILE=.depend.mini-me NO_SUBDIR=1 make -f /workspace/src/tests/sys/capsicum/Makefile _RECURSING_PROGS=t PROG=mini-me )
--- all_subdir_sbin ---
--- proto_uds.pieo ---
/usr/local/bin/x86_64-unknown-freebsd14.3-gcc13 --sysroot=/tmp/obj/workspace/src/amd64.amd64/tmp -B/usr/local/x86_64-unknown-freebsd14.3/bin/ -fpie -DPIC -O2 -pipe -fno-common -I/workspace/src/sbin/hastd -DHAVE_CAPSICUM -DPROTO_TCP_DEFAULT_PORT=8457 -DINET -DINET6 -fPIE -g -MD -MF.depend.proto_uds.pieo -MTproto_uds.pieo -std=gnu17 -Wno-format-zero-length -fstack-protector-strong -Wsystem-headers -Werror -Wall -Wno-format-y2k -W -Wno-unused-parameter -Wmissing-prototypes -Wpointer-arith -Wreturn-type -Wcast-qual -Wwrite-strings -Wswitch -Wshadow -Wunused-parameter -Wchar-subscripts -Wnested-externs -Wold-style-definition -Wno-pointer-sign -Wdate-time -Wno-format -Wno-error=address -Wno-error=array-bounds -Wno-error=attributes -Wno-error=bool-compare -Wno-error=cast-align -Wno-error=clobbered -Wno-error=deprecated-declarations -Wno-error=enum-compare -Wno-error=extra -Wno-error=logical-not-parentheses -Wno-error=strict-aliasing -Wno-error=uninitialized -Wno-error=unused-function -Wno-error=unused-value -Wno-error=empty-body -Wno-error=maybe-uninitialized -Wno-error=nonnull-compare -Wno-error=shift-negative-value -Wno-error=tautological-compare -Wno-error=unused-const-variable -Wno-error=bool-operation -Wno-error=deprecated -Wno-error=expansion-to-defined -Wno-error=format-overflow -Wno-error=format-truncation -Wno-error=implicit-fallthrough -Wno-error=int-in-bool-context -Wno-error=memset-elt-size -Wno-error=noexcept-type -Wno-error=nonnull -Wno-error=pointer-compare -Wno-error=stringop-overflow -Wno-error=aggressive-loop-optimizations -Wno-error=cast-function-type -Wno-error=catch-value -Wno-error=multistatement-macros -Wno-error=restrict -Wno-error=sizeof-pointer-memaccess -Wno-error=stringop-truncation -Wno-return-type -c /workspace/src/sbin/hastd/proto_uds.c -o proto_uds.pieo
--- all_subdir_lib ---
--- .depend.revoke_test ---
echo revoke_test.full: /tmp/obj/workspace/src/amd64.amd64/tmp/usr/lib/libc.a /tmp/obj/workspace/src/amd64.amd64/tmp/usr/lib/libprivateatf-c.a /tmp/obj/workspace/src/amd64.amd64/lib/libnetbsd/libnetbsd_pie.a >> .depend.revoke_test
--- t_revoke.pieo ---
/usr/local/bin/x86_64-unknown-freebsd14.3-gcc13 --sysroot=/tmp/obj/workspace/src/amd64.amd64/tmp -B/usr/local/x86_64-unknown-freebsd14.3/bin/ -fpie -DPIC -O2 -pipe -fno-common -I/workspace/src/lib/libnetbsd -I/workspace/src/contrib/netbsd-tests -fPIE -g -MD -MF.depend.revoke_test.t_revoke.pieo -MTt_revoke.pieo -std=gnu17 -Wno-format-zero-length -fstack-protector-strong -Wsystem-headers -Werror -Wall -Wno-format-y2k -Wno-uninitialized -Wno-pointer-sign -Wdate-time -Wno-error=address -Wno-error=array-bounds -Wno-error=attributes -Wno-error=bool-compare -Wno-error=cast-align -Wno-error=clobbered -Wno-error=deprecated-declarations -Wno-error=enum-compare -Wno-error=extra -Wno-error=logical-not-parentheses -Wno-error=strict-aliasing -Wno-error=uninitialized -Wno-error=unused-function -Wno-error=unused-value -Wno-error=empty-body -Wno-error=maybe-uninitialized -Wno-error=nonnull-compare -Wno-error=shift-negative-value -Wno-error=tautological-compare -Wno-error=unused-const-variable -Wno-error=bool-operation -Wno-error=deprecated -Wno-error=expansion-to-defined -Wno-error=format-overflow -Wno-error=format-truncation -Wno-error=implicit-fallthrough -Wno-error=int-in-bool-context -Wno-error=memset-elt-size -Wno-error=noexcept-type -Wno-error=nonnull -Wno-error=pointer-compare -Wno-error=stringop-overflow -Wno-error=aggressive-loop-optimizations -Wno-error=cast-function-type -Wno-error=catch-value -Wno-error=multistatement-macros -Wno-error=restrict -Wno-error=sizeof-pointer-memaccess -Wno-error=stringop-truncation -Wno-return-type -Wno-address-of-packed-member -c /workspace/src/contrib/netbsd-tests/lib/libc/sys/t_revoke.c -o t_revoke.pieo
--- all_subdir_usr.sbin ---
--- crontab.debug ---
--- all_subdir_tests ---
--- .depend.mini-me ---
--- all_subdir_usr.sbin ---
/usr/local/x86_64-unknown-freebsd14.3/bin/objcopy --only-keep-debug crontab.full crontab.debug
--- all_subdir_tests ---
echo mini-me.full: /tmp/obj/workspace/src/amd64.amd64/tmp/usr/lib/libc.a >> .depend.mini-me
--- mini-me.o ---
/usr/local/bin/x86_64-unknown-freebsd14.3-gcc13 --sysroot=/tmp/obj/workspace/src/amd64.amd64/tmp -B/usr/local/x86_64-unknown-freebsd14.3/bin/ -O2 -pipe -fno-common -I/workspace/src/tests -g -MD -MF.depend.mini-me.mini-me.o -MTmini-me.o -std=gnu17 -Wno-format-zero-length -fstack-protector-strong -Wsystem-headers -Werror -Wall -Wno-format-y2k -W -Wno-unused-parameter -Wmissing-prototypes -Wpointer-arith -Wreturn-type -Wcast-qual -Wwrite-strings -Wswitch -Wshadow -Wunused-parameter -Wcast-align -Wchar-subscripts -Wnested-externs -Wold-style-definition -Wno-pointer-sign -Wdate-time -Wno-error=address -Wno-error=array-bounds -Wno-error=attributes -Wno-error=bool-compare -Wno-error=cast-align -Wno-error=clobbered -Wno-error=deprecated-declarations -Wno-error=enum-compare -Wno-error=extra -Wno-error=logical-not-parentheses -Wno-error=strict-aliasing -Wno-error=uninitialized -Wno-error=unused-function -Wno-error=unused-value -Wno-error=empty-body -Wno-error=maybe-uninitialized -Wno-error=nonnull-compare -Wno-error=shift-negative-value -Wno-error=tautological-compare -Wno-error=unused-const-variable -Wno-error=bool-operation -Wno-error=deprecated -Wno-error=expansion-to-defined -Wno-error=format-overflow -Wno-error=format-truncation -Wno-error=implicit-fallthrough -Wno-error=int-in-bool-context -Wno-error=memset-elt-size -Wno-error=noexcept-type -Wno-error=nonnull -Wno-error=pointer-compare -Wno-error=stringop-overflow -Wno-error=aggressive-loop-optimizations -Wno-error=cast-function-type -Wno-error=catch-value -Wno-error=multistatement-macros -Wno-error=restrict -Wno-error=sizeof-pointer-memaccess -Wno-error=stringop-truncation -Wno-return-type -c /workspace/src/contrib/capsicum-test/mini-me.c -o mini-me.o
--- all_subdir_usr.sbin ---
--- crontab ---
/usr/local/x86_64-unknown-freebsd14.3/bin/objcopy --strip-debug --add-gnu-debuglink=crontab.debug crontab.full crontab
--- all_subdir_tests ---
--- mini-me.noexec ---
(cd /workspace/src/tests/sys/capsicum && DEPENDFILE=.depend.mini-me.noexec NO_SUBDIR=1 make -f /workspace/src/tests/sys/capsicum/Makefile _RECURSING_PROGS=t PROG=mini-me.noexec )
--- .depend.mini-me.noexec ---
echo mini-me.noexec.full: /tmp/obj/workspace/src/amd64.amd64/tmp/usr/lib/libc.a >> .depend.mini-me.noexec
--- mini-me.noexec.full ---
/usr/local/bin/x86_64-unknown-freebsd14.3-gcc13 --sysroot=/tmp/obj/workspace/src/amd64.amd64/tmp -B/usr/local/x86_64-unknown-freebsd14.3/bin/ -O2 -pipe -fno-common -I/workspace/src/tests -g -std=gnu17 -Wno-format-zero-length -fstack-protector-strong -Wsystem-headers -Werror -Wall -Wno-format-y2k -W -Wno-unused-parameter -Wmissing-prototypes -Wpointer-arith -Wreturn-type -Wcast-qual -Wwrite-strings -Wswitch -Wshadow -Wunused-parameter -Wcast-align -Wchar-subscripts -Wnested-externs -Wold-style-definition -Wno-pointer-sign -Wdate-time -Wno-error=address -Wno-error=array-bounds -Wno-error=attributes -Wno-error=bool-compare -Wno-error=cast-align -Wno-error=clobbered -Wno-error=deprecated-declarations -Wno-error=enum-compare -Wno-error=extra -Wno-error=logical-not-parentheses -Wno-error=strict-aliasing -Wno-error=uninitialized -Wno-error=unused-function -Wno-error=unused-value -Wno-error=empty-body -Wno-error=maybe-uninitialized -Wno-error=nonnull-compare -Wno-error=shift-negative-value -Wno-error=tautological-compare -Wno-error=unused-const-variable -Wno-error=bool-operation -Wno-error=deprecated -Wno-error=expansion-to-defined -Wno-error=format-overflow -Wno-error=format-truncation -Wno-error=implicit-fallthrough -Wno-error=int-in-bool-context -Wno-error=memset-elt-size -Wno-error=noexcept-type -Wno-error=nonnull -Wno-error=pointer-compare -Wno-error=stringop-overflow -Wno-error=aggressive-loop-optimizations -Wno-error=cast-function-type -Wno-error=catch-value -Wno-error=multistatement-macros -Wno-error=restrict -Wno-error=sizeof-pointer-memaccess -Wno-error=stringop-truncation -Wno-return-type -Wl,-zrelro -static -Wl,-znoexecstack -o mini-me.noexec.full mini-me.o
--- mini-me ---
--- mini-me.full ---
/usr/local/bin/x86_64-unknown-freebsd14.3-gcc13 --sysroot=/tmp/obj/workspace/src/amd64.amd64/tmp -B/usr/local/x86_64-unknown-freebsd14.3/bin/ -O2 -pipe -fno-common -I/workspace/src/tests -g -std=gnu17 -Wno-format-zero-length -fstack-protector-strong -Wsystem-headers -Werror -Wall -Wno-format-y2k -W -Wno-unused-parameter -Wmissing-prototypes -Wpointer-arith -Wreturn-type -Wcast-qual -Wwrite-strings -Wswitch -Wshadow -Wunused-parameter -Wcast-align -Wchar-subscripts -Wnested-externs -Wold-style-definition -Wno-pointer-sign -Wdate-time -Wno-error=address -Wno-error=array-bounds -Wno-error=attributes -Wno-error=bool-compare -Wno-error=cast-align -Wno-error=clobbered -Wno-error=deprecated-declarations -Wno-error=enum-compare -Wno-error=extra -Wno-error=logical-not-parentheses -Wno-error=strict-aliasing -Wno-error=uninitialized -Wno-error=unused-function -Wno-error=unused-value -Wno-error=empty-body -Wno-error=maybe-uninitialized -Wno-error=nonnull-compare -Wno-error=shift-negative-value -Wno-error=tautological-compare -Wno-error=unused-const-variable -Wno-error=bool-operation -Wno-error=deprecated -Wno-error=expansion-to-defined -Wno-error=format-overflow -Wno-error=format-truncation -Wno-error=implicit-fallthrough -Wno-error=int-in-bool-context -Wno-error=memset-elt-size -Wno-error=noexcept-type -Wno-error=nonnull -Wno-error=pointer-compare -Wno-error=stringop-overflow -Wno-error=aggressive-loop-optimizations -Wno-error=cast-function-type -Wno-error=catch-value -Wno-error=multistatement-macros -Wno-error=restrict -Wno-error=sizeof-pointer-memaccess -Wno-error=stringop-truncation -Wno-return-type -Wl,-zrelro -static -Wl,-znoexecstack -o mini-me.full mini-me.o
--- all_subdir_lib ---
--- revoke_test.full ---
/usr/local/bin/x86_64-unknown-freebsd14.3-gcc13 --sysroot=/tmp/obj/workspace/src/amd64.amd64/tmp -B/usr/local/x86_64-unknown-freebsd14.3/bin/ -O2 -pipe -fno-common -I/workspace/src/lib/libnetbsd -I/workspace/src/contrib/netbsd-tests -fPIE -g -std=gnu17 -Wno-format-zero-length -fstack-protector-strong -Wsystem-headers -Werror -Wall -Wno-format-y2k -Wno-uninitialized -Wno-pointer-sign -Wdate-time -Wno-error=address -Wno-error=array-bounds -Wno-error=attributes -Wno-error=bool-compare -Wno-error=cast-align -Wno-error=clobbered -Wno-error=deprecated-declarations -Wno-error=enum-compare -Wno-error=extra -Wno-error=logical-not-parentheses -Wno-error=strict-aliasing -Wno-error=uninitialized -Wno-error=unused-function -Wno-error=unused-value -Wno-error=empty-body -Wno-error=maybe-uninitialized -Wno-error=nonnull-compare -Wno-error=shift-negative-value -Wno-error=tautological-compare -Wno-error=unused-const-variable -Wno-error=bool-operation -Wno-error=deprecated -Wno-error=expansion-to-defined -Wno-error=format-overflow -Wno-error=format-truncation -Wno-error=implicit-fallthrough -Wno-error=int-in-bool-context -Wno-error=memset-elt-size -Wno-error=noexcept-type -Wno-error=nonnull -Wno-error=pointer-compare -Wno-error=stringop-overflow -Wno-error=aggressive-loop-optimizations -Wno-error=cast-function-type -Wno-error=catch-value -Wno-error=multistatement-macros -Wno-error=restrict -Wno-error=sizeof-pointer-memaccess -Wno-error=stringop-truncation -Wno-return-type -Wno-address-of-packed-member -L/tmp/obj/workspace/src/amd64.amd64/lib/libnetbsd -Wl,-zrelro -pie -Wl,-znoexecstack -o revoke_test.full t_revoke.pieo -lprivateatf-c -L/tmp/obj/workspace/src/amd64.amd64/lib/libnetbsd -lnetbsd_pie
--- revoke_test.debug ---
/usr/local/x86_64-unknown-freebsd14.3/bin/objcopy --only-keep-debug revoke_test.full revoke_test.debug
--- revoke_test ---
/usr/local/x86_64-unknown-freebsd14.3/bin/objcopy --strip-debug --add-gnu-debuglink=revoke_test.debug revoke_test.full revoke_test
--- select_test ---
(cd /workspace/src/lib/libc/tests/sys && DEPENDFILE=.depend.select_test NO_SUBDIR=1 make -f /workspace/src/lib/libc/tests/sys/Makefile _RECURSING_PROGS=t PROG=select_test )
--- all_subdir_tests ---
--- all_subdir_tests/sys/audit ---
--- open.full ---
/usr/local/bin/x86_64-unknown-freebsd14.3-gcc13 --sysroot=/tmp/obj/workspace/src/amd64.amd64/tmp -B/usr/local/x86_64-unknown-freebsd14.3/bin/ -O2 -pipe -fno-common -I/workspace/src/contrib/openbsm -g -std=gnu17 -Wno-format-zero-length -fstack-protector-strong -Wsystem-headers -Werror -Wall -Wno-format-y2k -W -Wno-unused-parameter -Wmissing-prototypes -Wpointer-arith -Wreturn-type -Wcast-qual -Wwrite-strings -Wswitch -Wshadow -Wunused-parameter -Wcast-align -Wchar-subscripts -Wnested-externs -Wold-style-definition -Wno-pointer-sign -Wdate-time -Wno-error=address -Wno-error=array-bounds -Wno-error=attributes -Wno-error=bool-compare -Wno-error=cast-align -Wno-error=clobbered -Wno-error=deprecated-declarations -Wno-error=enum-compare -Wno-error=extra -Wno-error=logical-not-parentheses -Wno-error=strict-aliasing -Wno-error=uninitialized -Wno-error=unused-function -Wno-error=unused-value -Wno-error=empty-body -Wno-error=maybe-uninitialized -Wno-error=nonnull-compare -Wno-error=shift-negative-value -Wno-error=tautological-compare -Wno-error=unused-const-variable -Wno-error=bool-operation -Wno-error=deprecated -Wno-error=expansion-to-defined -Wno-error=format-overflow -Wno-error=format-truncation -Wno-error=implicit-fallthrough -Wno-error=int-in-bool-context -Wno-error=memset-elt-size -Wno-error=noexcept-type -Wno-error=nonnull -Wno-error=pointer-compare -Wno-error=stringop-overflow -Wno-error=aggressive-loop-optimizations -Wno-error=cast-function-type -Wno-error=catch-value -Wno-error=multistatement-macros -Wno-error=restrict -Wno-error=sizeof-pointer-memaccess -Wno-error=stringop-truncation -Wno-return-type -lbsm -lutil -Wl,-zrelro -Wl,-znoexecstack -o open.full open.o utils.o /tmp/obj/workspace/src/amd64.amd64/tmp/usr/lib/libprivateauditd.a -lprivateatf-c
--- all_subdir_lib ---
--- .depend.select_test ---
echo select_test.full: /tmp/obj/workspace/src/amd64.amd64/tmp/usr/lib/libc.a /tmp/obj/workspace/src/amd64.amd64/tmp/usr/lib/libprivateatf-c.a /tmp/obj/workspace/src/amd64.amd64/lib/libnetbsd/libnetbsd_pie.a >> .depend.select_test
--- t_select.pieo ---
/usr/local/bin/x86_64-unknown-freebsd14.3-gcc13 --sysroot=/tmp/obj/workspace/src/amd64.amd64/tmp -B/usr/local/x86_64-unknown-freebsd14.3/bin/ -fpie -DPIC -O2 -pipe -fno-common -I/workspace/src/lib/libnetbsd -I/workspace/src/contrib/netbsd-tests -fPIE -g -MD -MF.depend.select_test.t_select.pieo -MTt_select.pieo -std=gnu17 -Wno-format-zero-length -fstack-protector-strong -Wsystem-headers -Werror -Wall -Wno-format-y2k -Wno-uninitialized -Wno-pointer-sign -Wdate-time -Wno-error=address -Wno-error=array-bounds -Wno-error=attributes -Wno-error=bool-compare -Wno-error=cast-align -Wno-error=clobbered -Wno-error=deprecated-declarations -Wno-error=enum-compare -Wno-error=extra -Wno-error=logical-not-parentheses -Wno-error=strict-aliasing -Wno-error=uninitialized -Wno-error=unused-function -Wno-error=unused-value -Wno-error=empty-body -Wno-error=maybe-uninitialized -Wno-error=nonnull-compare -Wno-error=shift-negative-value -Wno-error=tautological-compare -Wno-error=unused-const-variable -Wno-error=bool-operation -Wno-error=deprecated -Wno-error=expansion-to-defined -Wno-error=format-overflow -Wno-error=format-truncation -Wno-error=implicit-fallthrough -Wno-error=int-in-bool-context -Wno-error=memset-elt-size -Wno-error=noexcept-type -Wno-error=nonnull -Wno-error=pointer-compare -Wno-error=stringop-overflow -Wno-error=aggressive-loop-optimizations -Wno-error=cast-function-type -Wno-error=catch-value -Wno-error=multistatement-macros -Wno-error=restrict -Wno-error=sizeof-pointer-memaccess -Wno-error=stringop-truncation -Wno-return-type -Wno-address-of-packed-member -c /workspace/src/contrib/netbsd-tests/lib/libc/sys/t_select.c -o t_select.pieo
--- all_subdir_sbin ---
--- rangelock.pieo ---
/usr/local/bin/x86_64-unknown-freebsd14.3-gcc13 --sysroot=/tmp/obj/workspace/src/amd64.amd64/tmp -B/usr/local/x86_64-unknown-freebsd14.3/bin/ -fpie -DPIC -O2 -pipe -fno-common -I/workspace/src/sbin/hastd -DHAVE_CAPSICUM -DPROTO_TCP_DEFAULT_PORT=8457 -DINET -DINET6 -fPIE -g -MD -MF.depend.rangelock.pieo -MTrangelock.pieo -std=gnu17 -Wno-format-zero-length -fstack-protector-strong -Wsystem-headers -Werror -Wall -Wno-format-y2k -W -Wno-unused-parameter -Wmissing-prototypes -Wpointer-arith -Wreturn-type -Wcast-qual -Wwrite-strings -Wswitch -Wshadow -Wunused-parameter -Wchar-subscripts -Wnested-externs -Wold-style-definition -Wno-pointer-sign -Wdate-time -Wno-format -Wno-error=address -Wno-error=array-bounds -Wno-error=attributes -Wno-error=bool-compare -Wno-error=cast-align -Wno-error=clobbered -Wno-error=deprecated-declarations -Wno-error=enum-compare -Wno-error=extra -Wno-error=logical-not-parentheses -Wno-error=strict-aliasing -Wno-error=uninitialized -Wno-error=unused-function -Wno-error=unused-value -Wno-error=empty-body -Wno-error=maybe-uninitialized -Wno-error=nonnull-compare -Wno-error=shift-negative-value -Wno-error=tautological-compare -Wno-error=unused-const-variable -Wno-error=bool-operation -Wno-error=deprecated -Wno-error=expansion-to-defined -Wno-error=format-overflow -Wno-error=format-truncation -Wno-error=implicit-fallthrough -Wno-error=int-in-bool-context -Wno-error=memset-elt-size -Wno-error=noexcept-type -Wno-error=nonnull -Wno-error=pointer-compare -Wno-error=stringop-overflow -Wno-error=aggressive-loop-optimizations -Wno-error=cast-function-type -Wno-error=catch-value -Wno-error=multistatement-macros -Wno-error=restrict -Wno-error=sizeof-pointer-memaccess -Wno-error=stringop-truncation -Wno-return-type -c /workspace/src/sbin/hastd/rangelock.c -o rangelock.pieo
--- all_subdir_usr.sbin ---
--- all_subdir_usr.sbin/ctld ---
--- token.c ---
lex -otoken.c /workspace/src/usr.sbin/ctld/token.l
--- all_subdir_tests ---
--- open.debug ---
/usr/local/x86_64-unknown-freebsd14.3/bin/objcopy --only-keep-debug open.full open.debug
--- open ---
/usr/local/x86_64-unknown-freebsd14.3/bin/objcopy --strip-debug --add-gnu-debuglink=open.debug open.full open
--- all_subdir_tests/sys/capsicum ---
--- mini-me.noexec ---
/usr/local/bin/x86_64-unknown-freebsd14.3-ld: /tmp/obj/workspace/src/amd64.amd64/tmp/usr/lib/crt1.o: in function `_start':
/workspace/src/lib/csu/amd64/crt1_s.S:66:(.text+0x17): undefined reference to `main'
--- all_subdir_tests/sys/audit ---
--- ioctl ---
(cd /workspace/src/tests/sys/audit && DEPENDFILE=.depend.ioctl NO_SUBDIR=1 make -f /workspace/src/tests/sys/audit/Makefile _RECURSING_PROGS=t PROG=ioctl )
--- all_subdir_usr.sbin ---
--- .depend ---
echo ctld.full: /tmp/obj/workspace/src/amd64.amd64/tmp/usr/lib/libc.a /tmp/obj/workspace/src/amd64.amd64/tmp/usr/lib/libbsdxml.a /tmp/obj/workspace/src/amd64.amd64/lib/libiscsiutil/libiscsiutil_pie.a /tmp/obj/workspace/src/amd64.amd64/lib/libnvmf/libnvmf_pie.a /tmp/obj/workspace/src/amd64.amd64/lib/libnv/libnv_pie.a /tmp/obj/workspace/src/amd64.amd64/tmp/usr/lib/libmd.a /tmp/obj/workspace/src/amd64.amd64/tmp/usr/lib/libsbuf.a /tmp/obj/workspace/src/amd64.amd64/tmp/usr/lib/libutil.a /tmp/obj/workspace/src/amd64.amd64/tmp/usr/lib/libprivateucl.a /tmp/obj/workspace/src/amd64.amd64/tmp/usr/lib/libm.a /tmp/obj/workspace/src/amd64.amd64/lib/libnv/libnv_pie.a /tmp/obj/workspace/src/amd64.amd64/lib/libutil++/libutil++_pie.a >> .depend
echo ctld.full: /tmp/obj/workspace/src/amd64.amd64/tmp/usr/lib/libc++.a >> .depend
--- ctld.pieo ---
/usr/local/bin/x86_64-unknown-freebsd14.3-g++13 --sysroot=/tmp/obj/workspace/src/amd64.amd64/tmp -B/usr/local/x86_64-unknown-freebsd14.3/bin/ -fpie -O2 -pipe -fno-common -I/workspace/src/contrib/libucl/include -I/workspace/src/usr.sbin/ctld -I/workspace/src/sys -I/workspace/src/sys/cam/ctl -I/workspace/src/sys/dev/iscsi -I/workspace/src/lib/libiscsiutil -I/workspace/src/lib/libutil++ -I/workspace/src/lib/libnvmf -fPIE -g -MD -MF.depend.ctld.pieo -MTctld.pieo -Wno-format-zero-length -fstack-protector-strong -Wsystem-headers -Werror -Wall -Wno-format-y2k -W -Wno-unused-parameter -Wpointer-arith -Wreturn-type -Wcast-qual -Wwrite-strings -Wswitch -Wshadow -Wunused-parameter -Wchar-subscripts -Wdate-time -Wno-error=address -Wno-error=array-bounds -Wno-error=attributes -Wno-error=bool-compare -Wno-error=cast-align -Wno-error=clobbered -Wno-error=deprecated-declarations -Wno-error=enum-compare -Wno-error=extra -Wno-error=logical-not-parentheses -Wno-error=strict-aliasing -Wno-error=uninitialized -Wno-error=unused-function -Wno-error=unused-value -Wno-error=empty-body -Wno-error=maybe-uninitialized -Wno-error=nonnull-compare -Wno-error=shift-negative-value -Wno-error=tautological-compare -Wno-error=unused-const-variable -Wno-error=bool-operation -Wno-error=deprecated -Wno-error=expansion-to-defined -Wno-error=format-overflow -Wno-error=format-truncation -Wno-error=implicit-fallthrough -Wno-error=int-in-bool-context -Wno-error=memset-elt-size -Wno-error=noexcept-type -Wno-error=nonnull -Wno-error=pointer-compare -Wno-error=stringop-overflow -Wno-error=aggressive-loop-optimizations -Wno-error=cast-function-type -Wno-error=catch-value -Wno-error=multistatement-macros -Wno-error=restrict -Wno-error=sizeof-pointer-memaccess -Wno-error=stringop-truncation -Wno-return-type -fPIE -g -std=gnu++17 -Wno-error=class-memaccess -Wno-literal-suffix -Wno-error=unknown-pragmas -Wno-dangling-reference -Wno-shadow -c /workspace/src/usr.sbin/ctld/ctld.cc -o ctld.pieo
--- all_subdir_usr.bin ---
--- all_subdir_usr.bin/col/tests ---
===> usr.bin/col/tests (all)
--- all_subdir_tests ---
--- .depend.ioctl ---
echo ioctl.full: /tmp/obj/workspace/src/amd64.amd64/tmp/usr/lib/libc.a /tmp/obj/workspace/src/amd64.amd64/tmp/usr/lib/libprivateatf-c.a >> .depend.ioctl
--- ioctl.o ---
/usr/local/bin/x86_64-unknown-freebsd14.3-gcc13 --sysroot=/tmp/obj/workspace/src/amd64.amd64/tmp -B/usr/local/x86_64-unknown-freebsd14.3/bin/ -O2 -pipe -fno-common -I/workspace/src/contrib/openbsm -g -MD -MF.depend.ioctl.ioctl.o -MTioctl.o -std=gnu17 -Wno-format-zero-length -fstack-protector-strong -Wsystem-headers -Werror -Wall -Wno-format-y2k -W -Wno-unused-parameter -Wmissing-prototypes -Wpointer-arith -Wreturn-type -Wcast-qual -Wwrite-strings -Wswitch -Wshadow -Wunused-parameter -Wcast-align -Wchar-subscripts -Wnested-externs -Wold-style-definition -Wno-pointer-sign -Wdate-time -Wno-error=address -Wno-error=array-bounds -Wno-error=attributes -Wno-error=bool-compare -Wno-error=cast-align -Wno-error=clobbered -Wno-error=deprecated-declarations -Wno-error=enum-compare -Wno-error=extra -Wno-error=logical-not-parentheses -Wno-error=strict-aliasing -Wno-error=uninitialized -Wno-error=unused-function -Wno-error=unused-value -Wno-error=empty-body -Wno-error=maybe-uninitialized -Wno-error=nonnull-compare -Wno-error=shift-negative-value -Wno-error=tautological-compare -Wno-error=unused-const-variable -Wno-error=bool-operation -Wno-error=deprecated -Wno-error=expansion-to-defined -Wno-error=format-overflow -Wno-error=format-truncation -Wno-error=implicit-fallthrough -Wno-error=int-in-bool-context -Wno-error=memset-elt-size -Wno-error=noexcept-type -Wno-error=nonnull -Wno-error=pointer-compare -Wno-error=stringop-overflow -Wno-error=aggressive-loop-optimizations -Wno-error=cast-function-type -Wno-error=catch-value -Wno-error=multistatement-macros -Wno-error=restrict -Wno-error=sizeof-pointer-memaccess -Wno-error=stringop-truncation -Wno-return-type -c /workspace/src/tests/sys/audit/ioctl.c -o ioctl.o
--- all_subdir_usr.bin ---
--- col_test ---
echo '#! /usr/libexec/atf-sh' > col_test.tmp
cat /workspace/src/usr.bin/col/tests/col_test.sh >>col_test.tmp
chmod +x col_test.tmp
mv col_test.tmp col_test
--- Kyuafile ---
--- col.1.gz ---
gzip -cn /workspace/src/usr.bin/col/col.1 > col.1.gz
--- col.full ---
/usr/local/bin/x86_64-unknown-freebsd14.3-gcc13 --sysroot=/tmp/obj/workspace/src/amd64.amd64/tmp -B/usr/local/x86_64-unknown-freebsd14.3/bin/ -O2 -pipe -fno-common -fPIE -g -std=gnu17 -Wno-format-zero-length -fstack-protector-strong -Wsystem-headers -Werror -Wall -Wno-format-y2k -W -Wno-unused-parameter -Wmissing-prototypes -Wpointer-arith -Wreturn-type -Wcast-qual -Wwrite-strings -Wswitch -Wshadow -Wunused-parameter -Wcast-align -Wchar-subscripts -Wnested-externs -Wold-style-definition -Wno-pointer-sign -Wdate-time -Wno-error=address -Wno-error=array-bounds -Wno-error=attributes -Wno-error=bool-compare -Wno-error=cast-align -Wno-error=clobbered -Wno-error=deprecated-declarations -Wno-error=enum-compare -Wno-error=extra -Wno-error=logical-not-parentheses -Wno-error=strict-aliasing -Wno-error=uninitialized -Wno-error=unused-function -Wno-error=unused-value -Wno-error=empty-body -Wno-error=maybe-uninitialized -Wno-error=nonnull-compare -Wno-error=shift-negative-value -Wno-error=tautological-compare -Wno-error=unused-const-variable -Wno-error=bool-operation -Wno-error=deprecated -Wno-error=expansion-to-defined -Wno-error=format-overflow -Wno-error=format-truncation -Wno-error=implicit-fallthrough -Wno-error=int-in-bool-context -Wno-error=memset-elt-size -Wno-error=noexcept-type -Wno-error=nonnull -Wno-error=pointer-compare -Wno-error=stringop-overflow -Wno-error=aggressive-loop-optimizations -Wno-error=cast-function-type -Wno-error=catch-value -Wno-error=multistatement-macros -Wno-error=restrict -Wno-error=sizeof-pointer-memaccess -Wno-error=stringop-truncation -Wno-return-type -Wl,-zrelro -pie -Wl,-znoexecstack -o col.full col.pieo
--- all_subdir_sbin ---
--- subr.pieo ---
/usr/local/bin/x86_64-unknown-freebsd14.3-gcc13 --sysroot=/tmp/obj/workspace/src/amd64.amd64/tmp -B/usr/local/x86_64-unknown-freebsd14.3/bin/ -fpie -DPIC -O2 -pipe -fno-common -I/workspace/src/sbin/hastd -DHAVE_CAPSICUM -DPROTO_TCP_DEFAULT_PORT=8457 -DINET -DINET6 -fPIE -g -MD -MF.depend.subr.pieo -MTsubr.pieo -std=gnu17 -Wno-format-zero-length -fstack-protector-strong -Wsystem-headers -Werror -Wall -Wno-format-y2k -W -Wno-unused-parameter -Wmissing-prototypes -Wpointer-arith -Wreturn-type -Wcast-qual -Wwrite-strings -Wswitch -Wshadow -Wunused-parameter -Wchar-subscripts -Wnested-externs -Wold-style-definition -Wno-pointer-sign -Wdate-time -Wno-format -Wno-error=address -Wno-error=array-bounds -Wno-error=attributes -Wno-error=bool-compare -Wno-error=cast-align -Wno-error=clobbered -Wno-error=deprecated-declarations -Wno-error=enum-compare -Wno-error=extra -Wno-error=logical-not-parentheses -Wno-error=strict-aliasing -Wno-error=uninitialized -Wno-error=unused-function -Wno-error=unused-value -Wno-error=empty-body -Wno-error=maybe-uninitialized -Wno-error=nonnull-compare -Wno-error=shift-negative-value -Wno-error=tautological-compare -Wno-error=unused-const-variable -Wno-error=bool-operation -Wno-error=deprecated -Wno-error=expansion-to-defined -Wno-error=format-overflow -Wno-error=format-truncation -Wno-error=implicit-fallthrough -Wno-error=int-in-bool-context -Wno-error=memset-elt-size -Wno-error=noexcept-type -Wno-error=nonnull -Wno-error=pointer-compare -Wno-error=stringop-overflow -Wno-error=aggressive-loop-optimizations -Wno-error=cast-function-type -Wno-error=catch-value -Wno-error=multistatement-macros -Wno-error=restrict -Wno-error=sizeof-pointer-memaccess -Wno-error=stringop-truncation -Wno-return-type -c /workspace/src/sbin/hastd/subr.c -o subr.pieo
--- all_subdir_tests ---
--- all_subdir_tests/sys/capsicum ---
collect2: error: ld returned 1 exit status
*** [mini-me.noexec.full] Error code 1
make[6]: stopped in /workspace/src/tests/sys/capsicum
make[2]: stopped in /workspace/src
--- all_subdir_usr.bin ---
make[2]: stopped in /workspace/src
--- all_subdir_usr.sbin ---
make[2]: stopped in /workspace/src
--- all_subdir_sbin ---
make[2]: stopped in /workspace/src
--- all_subdir_rescue ---
*** [objs] Error code 6
make[4]: stopped in /workspace/src/rescue/rescue
1 error
make[4]: stopped in /workspace/src/rescue/rescue
make[3]: stopped in /workspace/src/rescue
--- all_subdir_lib ---
make[3]: stopped in /workspace/src/lib
--- all_subdir_rescue ---
make[2]: stopped in /workspace/src
--- all_subdir_cddl ---
make[6]: stopped in /workspace/src/cddl/usr.sbin/zfsd/tests
--- all_subdir_lib ---
make[2]: stopped in /workspace/src
--- all_subdir_cddl ---
make[5]: stopped in /workspace/src/cddl/usr.sbin/zfsd
make[4]: stopped in /workspace/src/cddl/usr.sbin
make[3]: stopped in /workspace/src/cddl
make[2]: stopped in /workspace/src
154.04 real 1468.61 user 147.93 sys
make[1]: stopped in /workspace/src
make: stopped in /workspace/src
Build step 'Execute shell' marked build as failure
[WARNINGS]Skipping publisher since build result is FAILURE
[PostBuildScript] - [INFO] Executing post build scripts.
[FreeBSD-main-amd64-gcc13_build] $ /bin/sh -xe /tmp/jenkins17855071975667823158.sh
+ sh freebsd-ci/scripts/jail/clean.sh
clean jail FreeBSD-main-amd64-gcc13_build
Checking for post-build
Performing post-build step
Checking if email needs to be generated
Email was triggered for: Failure - Any
Sending email for trigger: Failure - Any
Sending mail from default account using System Admin e-mail address