FreeBSD-main-amd64-test - Build #26883 - Still Unstable
Date: Sat, 04 Oct 2025 23:28:51 UTC
FreeBSD-main-amd64-test - Build #26883 (d0ff67db2908a56b2f146963bb79f1a8e6283131) - Still Unstable
Build information: https://ci.FreeBSD.org/job/FreeBSD-main-amd64-test/26883/
Full change log: https://ci.FreeBSD.org/job/FreeBSD-main-amd64-test/26883/changes
Full build log: https://ci.FreeBSD.org/job/FreeBSD-main-amd64-test/26883/console
Status explanation:
"Unstable" - some tests are suspected being broken by the following changes
"Still Unstable" - the failing test cases have not been fixed by these
following changes and this is a notification to note that
these changes have not been fully tested by the CI system
Change summaries:
(Those commits are likely but not certainly responsible)
4b8b4c7dbf0fd4f946195dd7e8e4ddf10505beea by cperciva:
release: Check for empty NODISTSETS
e64eb9ea0f4c88a9fa32ae3ae517cbe15a193a08 by cperciva:
release: Respect NODISTSETS
d0ff67db2908a56b2f146963bb79f1a8e6283131 by cperciva:
release: Publish pkgbase-repo.tar
The failed test cases:
30 tests failed.
FAILED: libexec.nuageinit.nuage.addfile
Error Message:
atf-check failed; see the output of the test for details
FAILED: libexec.nuageinit.nuage.addgroup
Error Message:
atf-check failed; see the output of the test for details
FAILED: libexec.nuageinit.nuage.addsshkey
Error Message:
atf-check failed; see the output of the test for details
FAILED: libexec.nuageinit.nuage.adduser
Error Message:
atf-check failed; see the output of the test for details
FAILED: libexec.nuageinit.nuage.adduser_passwd
Error Message:
atf-check failed; see the output of the test for details
FAILED: libexec.nuageinit.nuage.sethostname
Error Message:
atf-check failed; see the output of the test for details
FAILED: libexec.nuageinit.nuageinit.args
Error Message:
atf-check failed; see the output of the test for details
FAILED: libexec.nuageinit.nuageinit.config2
Error Message:
atf-check failed; see the output of the test for details
FAILED: libexec.nuageinit.nuageinit.config2_pubkeys
Error Message:
atf-check failed; see the output of the test for details
FAILED: libexec.nuageinit.nuageinit.config2_pubkeys_meta_data
Error Message:
atf-check failed; see the output of the test for details
FAILED: libexec.nuageinit.nuageinit.config2_pubkeys_user_data
Error Message:
atf-check failed; see the output of the test for details
FAILED: libexec.nuageinit.nuageinit.config2_ssh_keys
Error Message:
atf-check failed; see the output of the test for details
FAILED: libexec.nuageinit.nuageinit.config2_userdata_fqdn_and_hostname
Error Message:
atf-check failed; see the output of the test for details
FAILED: libexec.nuageinit.nuageinit.config2_userdata_packages
Error Message:
atf-check failed; see the output of the test for details
FAILED: libexec.nuageinit.nuageinit.config2_userdata_runcmd
Error Message:
atf-check failed; see the output of the test for details
FAILED: libexec.nuageinit.nuageinit.config2_userdata_shebang
Error Message:
atf-check failed; see the output of the test for details
FAILED: libexec.nuageinit.nuageinit.config2_userdata_update_packages
Error Message:
atf-check failed; see the output of the test for details
FAILED: libexec.nuageinit.nuageinit.config2_userdata_upgrade_packages
Error Message:
atf-check failed; see the output of the test for details
FAILED: libexec.nuageinit.nuageinit.config2_userdata_write_files
Error Message:
atf-check failed; see the output of the test for details
FAILED: libexec.nuageinit.nuageinit.nocloud
Error Message:
atf-check failed; see the output of the test for details
FAILED: libexec.nuageinit.nuageinit.nocloud_user_data_script
Error Message:
atf-check failed; see the output of the test for details
FAILED: libexec.nuageinit.nuageinit.nocloud_userdata_cloudconfig_chpasswd
Error Message:
atf-check failed; see the output of the test for details
FAILED: libexec.nuageinit.nuageinit.nocloud_userdata_cloudconfig_chpasswd_list_list
Error Message:
atf-check failed; see the output of the test for details
FAILED: libexec.nuageinit.nuageinit.nocloud_userdata_cloudconfig_chpasswd_list_string
Error Message:
atf-check failed; see the output of the test for details
FAILED: libexec.nuageinit.nuageinit.nocloud_userdata_cloudconfig_ssh_pwauth
Error Message:
atf-check failed; see the output of the test for details
FAILED: libexec.nuageinit.nuageinit.nocloud_userdata_cloudconfig_users
Error Message:
atf-check failed; see the output of the test for details
FAILED: libexec.nuageinit.nuageinit.nocloud_userdata_script
Error Message:
atf-check failed; see the output of the test for details
FAILED: libexec.nuageinit.utils.dirname
Error Message:
atf-check failed; see the output of the test for details
FAILED: libexec.nuageinit.utils.err
Error Message:
atf-check failed; see the output of the test for details
FAILED: libexec.nuageinit.utils.warn
Error Message:
atf-check failed; see the output of the test for details