FreeBSD-main-amd64-gcc14_build - Build #1742 - Failure

From: <jenkins-admin_at_FreeBSD.org>
Date: Fri, 03 Oct 2025 12:59:22 UTC
FreeBSD-main-amd64-gcc14_build - Build #1742 (dfc9da6248491072e31f924f5ae6b6238603089a) - Failure

Build information: https://ci.FreeBSD.org/job/FreeBSD-main-amd64-gcc14_build/1742/
Full change log: https://ci.FreeBSD.org/job/FreeBSD-main-amd64-gcc14_build/1742/changes
Full build log: https://ci.FreeBSD.org/job/FreeBSD-main-amd64-gcc14_build/1742/console

Status explanation:
"Failure" - the build is suspected being broken by the following changes
"Still Failing" - the build has not been fixed by the following changes and
                  this is a notification to note that these changes have
                  not been fully tested by the CI system

Change summaries:
(Those commits are likely but not certainly responsible)

No changes


The end of the build log:

[...truncated 96.53 MiB...]
      | ^~~~~~~~~~~~~~~~~
--- all_subdir_usr.bin ---
gzip -cn /workspace/src/usr.bin/login/login.1 > login.1.gz
--- all_subdir_usr.sbin ---
/tmp/obj/workspace/src/amd64.amd64/tmp/usr/include/c++/v1/list:617:1: warning: 'always_inline' function might not be inlinable unless also declared 'inline' [-Wattributes]
  617 | __list_imp<_Tp, _Alloc>::~__list_imp() {
      | ^~~~~~~~~~~~~~~~~~~~~~~
/tmp/obj/workspace/src/amd64.amd64/tmp/usr/include/c++/v1/list:617:1: warning: 'always_inline' function might not be inlinable unless also declared 'inline' [-Wattributes]
/tmp/obj/workspace/src/amd64.amd64/tmp/usr/include/c++/v1/list:617:1: warning: 'always_inline' function might not be inlinable unless also declared 'inline' [-Wattributes]
/tmp/obj/workspace/src/amd64.amd64/tmp/usr/include/c++/v1/list:617:1: warning: 'always_inline' function might not be inlinable unless also declared 'inline' [-Wattributes]
/tmp/obj/workspace/src/amd64.amd64/tmp/usr/include/c++/v1/list:617:1: warning: 'always_inline' function might not be inlinable unless also declared 'inline' [-Wattributes]
/tmp/obj/workspace/src/amd64.amd64/tmp/usr/include/c++/v1/list:617:1: warning: 'always_inline' function might not be inlinable unless also declared 'inline' [-Wattributes]
/tmp/obj/workspace/src/amd64.amd64/tmp/usr/include/c++/v1/list:617:1: warning: 'always_inline' function might not be inlinable unless also declared 'inline' [-Wattributes]
/tmp/obj/workspace/src/amd64.amd64/tmp/usr/include/c++/v1/list:617:1: warning: 'always_inline' function might not be inlinable unless also declared 'inline' [-Wattributes]
/tmp/obj/workspace/src/amd64.amd64/tmp/usr/include/c++/v1/list:617:1: warning: 'always_inline' function might not be inlinable unless also declared 'inline' [-Wattributes]
In file included from /tmp/obj/workspace/src/amd64.amd64/tmp/usr/include/c++/v1/__charconv/to_chars_integral.h:17,
                 from /tmp/obj/workspace/src/amd64.amd64/tmp/usr/include/c++/v1/__format/formatter_integral.h:13,
                 from /tmp/obj/workspace/src/amd64.amd64/tmp/usr/include/c++/v1/__format/formatter_bool.h:19,
                 from /tmp/obj/workspace/src/amd64.amd64/tmp/usr/include/c++/v1/vector:325:
/tmp/obj/workspace/src/amd64.amd64/tmp/usr/include/c++/v1/__charconv/to_chars_base_10.h:71:59: warning: 'always_inline' function might not be inlinable unless also declared 'inline' [-Wattributes]
   71 | _LIBCPP_CONSTEXPR_SINCE_CXX23 _LIBCPP_HIDE_FROM_ABI char* __append10(char* __first, _Tp __value) noexcept {
      |                                                           ^~~~~~~~~~
/tmp/obj/workspace/src/amd64.amd64/tmp/usr/include/c++/v1/__charconv/to_chars_base_10.h:71:59: warning: 'always_inline' function might not be inlinable unless also declared 'inline' [-Wattributes]
/tmp/obj/workspace/src/amd64.amd64/tmp/usr/include/c++/v1/__atomic/atomic_sync.h:161:54: warning: 'always_inline' function might not be inlinable unless also declared 'inline' [-Wattributes]
  161 | _LIBCPP_AVAILABILITY_SYNC _LIBCPP_HIDE_FROM_ABI void __atomic_notify_all(const _AtomicWaitable& __a) {
      |                                                      ^~~~~~~~~~~~~~~~~~~
/tmp/obj/workspace/src/amd64.amd64/tmp/usr/include/c++/v1/__atomic/atomic_sync.h:161:54: warning: 'always_inline' function might not be inlinable unless also declared 'inline' [-Wattributes]
/tmp/obj/workspace/src/amd64.amd64/tmp/usr/include/c++/v1/__atomic/atomic_sync.h:155:54: warning: 'always_inline' function might not be inlinable unless also declared 'inline' [-Wattributes]
  155 | _LIBCPP_AVAILABILITY_SYNC _LIBCPP_HIDE_FROM_ABI void __atomic_notify_one(const _AtomicWaitable& __a) {
      |                                                      ^~~~~~~~~~~~~~~~~~~
--- all_subdir_rescue ---
--- parse.o ---
--- all_subdir_usr.sbin ---
/tmp/obj/workspace/src/amd64.amd64/tmp/usr/include/c++/v1/__atomic/atomic_sync.h:155:54: warning: 'always_inline' function might not be inlinable unless also declared 'inline' [-Wattributes]
/tmp/obj/workspace/src/amd64.amd64/tmp/usr/include/c++/v1/__atomic/atomic_sync.h:197:1: warning: 'always_inline' function might not be inlinable unless also declared 'inline' [-Wattributes]
  197 | __atomic_wait(_AtomicWaitable& __a, _Up __val, memory_order __order) {
      | ^~~~~~~~~~~~~
/tmp/obj/workspace/src/amd64.amd64/tmp/usr/include/c++/v1/__atomic/atomic_sync.h:197:1: warning: 'always_inline' function might not be inlinable unless also declared 'inline' [-Wattributes]
--- all_subdir_rescue ---
/usr/local/bin/x86_64-unknown-freebsd14.2-gcc14 --sysroot=/tmp/obj/workspace/src/amd64.amd64/tmp -B/usr/local/x86_64-unknown-freebsd14.2/bin/  -O2 -pipe -fno-common   -Wall -Wmissing-prototypes -Wno-uninitialized -Wstrict-prototypes -DENABLE_ALTQ -I/workspace/src/sbin/pfctl -I/workspace/src/lib/libpfctl -I/tmp/obj/workspace/src/amd64.amd64/rescue/rescue/workspace/src/lib/libpfctl -DWITH_INET6 -DWITH_INET -DRESCUE -I/tmp/obj/workspace/src/amd64.amd64/lib/libifconfig -I/tmp/obj/workspace/src/amd64.amd64/lib/libiscsiutil -g -MD  -MF.depend.parse.o -MTparse.o -std=gnu17 -Wno-format-zero-length -fstack-protector-strong -Wsystem-headers -Werror -Wall -Wno-format-y2k -Wno-uninitialized -Wno-pointer-sign -Wdate-time -Wno-error=address -Wno-error=array-bounds -Wno-error=attributes -Wno-error=bool-compare -Wno-error=cast-align -Wno-error=clobbered -Wno-error=deprecated-declarations -Wno-error=enum-compare -Wno-error=extra -Wno-error=logical-not-parentheses -Wno-error=strict-aliasing -Wno-error=uninitialized -Wno-error=unused-function -Wno-error=unused-value -Wno-error=empty-body -Wno-error=maybe-uninitialized -Wno-error=nonnull-compare -Wno-error=shift-negative-value -Wno-error=tautological-compare -Wno-error=unused-const-variable -Wno-error=bool-operation -Wno-error=deprecated -Wno-error=expansion-to-defined -Wno-error=format-overflow -Wno-error=format-truncation -Wno-error=implicit-fallthrough -Wno-error=int-in-bool-context -Wno-error=memset-elt-size -Wno-error=noexcept-type -Wno-error=nonnull -Wno-error=pointer-compare -Wno-error=stringop-overflow -Wno-error=aggressive-loop-optimizations -Wno-error=cast-function-type -Wno-error=catch-value -Wno-error=multistatement-macros -Wno-error=restrict -Wno-error=sizeof-pointer-memaccess -Wno-error=stringop-truncation -Wno-return-type -Wno-address-of-packed-member       -c parse.c -o parse.o
--- all_subdir_usr.sbin ---
In file included from /tmp/obj/workspace/src/amd64.amd64/tmp/usr/include/c++/v1/__atomic/contention_t.h:12,
                 from /tmp/obj/workspace/src/amd64.amd64/tmp/usr/include/c++/v1/__atomic/atomic_sync.h:12:
/tmp/obj/workspace/src/amd64.amd64/tmp/usr/include/c++/v1/__atomic/cxx_atomic_impl.h:83:28: warning: 'always_inline' function might not be inlinable unless also declared 'inline' [-Wattributes]
   83 | _LIBCPP_HIDE_FROM_ABI void __cxx_atomic_store(__cxx_atomic_base_impl<_Tp>* __a, _Tp __val, memory_order __order) {
      |                            ^~~~~~~~~~~~~~~~~~
/tmp/obj/workspace/src/amd64.amd64/tmp/usr/include/c++/v1/__atomic/cxx_atomic_impl.h:78:1: warning: 'always_inline' function might not be inlinable unless also declared 'inline' [-Wattributes]
   78 | __cxx_atomic_store(volatile __cxx_atomic_base_impl<_Tp>* __a, _Tp __val, memory_order __order) {
      | ^~~~~~~~~~~~~~~~~~
/tmp/obj/workspace/src/amd64.amd64/tmp/usr/include/c++/v1/__atomic/cxx_atomic_impl.h:123:27: warning: 'always_inline' function might not be inlinable unless also declared 'inline' [-Wattributes]
  123 | _LIBCPP_HIDE_FROM_ABI _Tp __cxx_atomic_exchange(__cxx_atomic_base_impl<_Tp>* __a, _Tp __value, memory_order __order) {
      |                           ^~~~~~~~~~~~~~~~~~~~~
/tmp/obj/workspace/src/amd64.amd64/tmp/usr/include/c++/v1/__atomic/cxx_atomic_impl.h:115:1: warning: 'always_inline' function might not be inlinable unless also declared 'inline' [-Wattributes]
  115 | __cxx_atomic_exchange(volatile __cxx_atomic_base_impl<_Tp>* __a, _Tp __value, memory_order __order) {
      | ^~~~~~~~~~~~~~~~~~~~~
/tmp/obj/workspace/src/amd64.amd64/tmp/usr/include/c++/v1/__atomic/cxx_atomic_impl.h:107:27: warning: 'always_inline' function might not be inlinable unless also declared 'inline' [-Wattributes]
  107 | _LIBCPP_HIDE_FROM_ABI _Tp __cxx_atomic_load(const __cxx_atomic_base_impl<_Tp>* __a, memory_order __order) {
      |                           ^~~~~~~~~~~~~~~~~
--- all_subdir_usr.bin ---
--- login.debug ---
--- all_subdir_usr.sbin ---
/tmp/obj/workspace/src/amd64.amd64/tmp/usr/include/c++/v1/__atomic/cxx_atomic_impl.h:88:27: warning: 'always_inline' function might not be inlinable unless also declared 'inline' [-Wattributes]
   88 | _LIBCPP_HIDE_FROM_ABI _Tp __cxx_atomic_load(const volatile __cxx_atomic_base_impl<_Tp>* __a, memory_order __order) {
      |                           ^~~~~~~~~~~~~~~~~
/tmp/obj/workspace/src/amd64.amd64/tmp/usr/include/c++/v1/__math/special_functions.h:29:29: warning: 'always_inline' function might not be inlinable unless also declared 'inline' [-Wattributes]
   29 | _LIBCPP_HIDE_FROM_ABI _Real __hermite(unsigned __n, _Real __x) {
      |                             ^~~~~~~~~
/tmp/obj/workspace/src/amd64.amd64/tmp/usr/include/c++/v1/__math/special_functions.h:29:29: warning: 'always_inline' function might not be inlinable unless also declared 'inline' [-Wattributes]
--- all_subdir_usr.bin ---
/usr/local/x86_64-unknown-freebsd14.2/bin/objcopy --only-keep-debug login.full login.debug
--- all_subdir_usr.sbin ---
/tmp/obj/workspace/src/amd64.amd64/tmp/usr/include/c++/v1/__math/hypot.h:59:29: warning: 'always_inline' function might not be inlinable unless also declared 'inline' [-Wattributes]
   59 | _LIBCPP_HIDE_FROM_ABI _Real __hypot(_Real __x, _Real __y, _Real __z) {
      |                             ^~~~~~~
--- all_subdir_tests ---
--- 00 ---
--- all_subdir_usr.sbin ---
/tmp/obj/workspace/src/amd64.amd64/tmp/usr/include/c++/v1/__math/hypot.h:59:29: warning: 'always_inline' function might not be inlinable unless also declared 'inline' [-Wattributes]
/tmp/obj/workspace/src/amd64.amd64/tmp/usr/include/c++/v1/__math/hypot.h:59:29: warning: 'always_inline' function might not be inlinable unless also declared 'inline' [-Wattributes]
--- all_subdir_tests ---
cat /workspace/src/contrib/pjdfstest/tests/utimensat/00.t >00.tmp
--- all_subdir_usr.sbin ---
/tmp/obj/workspace/src/amd64.amd64/tmp/usr/include/c++/v1/new:272:28: warning: 'always_inline' function might not be inlinable unless also declared 'inline' [-Wattributes]
  272 | _LIBCPP_HIDE_FROM_ABI void __libcpp_operator_delete(_Args... __args) {
      |                            ^~~~~~~~~~~~~~~~~~~~~~~~
/tmp/obj/workspace/src/amd64.amd64/tmp/usr/include/c++/v1/new:272:28: warning: 'always_inline' function might not be inlinable unless also declared 'inline' [-Wattributes]
--- all_subdir_tests ---
chmod +x 00.tmp
--- all_subdir_usr.bin ---
--- login ---
--- all_subdir_usr.sbin ---
/tmp/obj/workspace/src/amd64.amd64/tmp/usr/include/c++/v1/new:293:28: warning: 'always_inline' function might not be inlinable unless also declared 'inline' [-Wattributes]
  293 | _LIBCPP_HIDE_FROM_ABI void __do_deallocate_handle_size(void* __ptr, size_t __size, _Args... __args) {
      |                            ^~~~~~~~~~~~~~~~~~~~~~~~~~~
/tmp/obj/workspace/src/amd64.amd64/tmp/usr/include/c++/v1/new:293:28: warning: 'always_inline' function might not be inlinable unless also declared 'inline' [-Wattributes]
--- all_subdir_tests ---
mv 00.tmp 00
--- all_subdir_usr.sbin ---
/tmp/obj/workspace/src/amd64.amd64/tmp/usr/include/c++/v1/new:263:29: warning: 'always_inline' function might not be inlinable unless also declared 'inline' [-Wattributes]
  263 | _LIBCPP_HIDE_FROM_ABI void* __libcpp_operator_new(_Args... __args) {
      |                             ^~~~~~~~~~~~~~~~~~~~~
--- all_subdir_usr.bin ---
/usr/local/x86_64-unknown-freebsd14.2/bin/objcopy --strip-debug --add-gnu-debuglink=login.debug  login.full login
--- all_subdir_usr.sbin ---
/tmp/obj/workspace/src/amd64.amd64/tmp/usr/include/c++/v1/new:263:29: warning: 'always_inline' function might not be inlinable unless also declared 'inline' [-Wattributes]
--- all_subdir_tests ---
--- 01 ---
cat /workspace/src/contrib/pjdfstest/tests/utimensat/01.t >01.tmp
chmod +x 01.tmp
mv 01.tmp 01
--- all_subdir_usr.bin ---
--- all_subdir_usr.bin/logins ---
===> usr.bin/logins (all)
--- all_subdir_tests ---
--- 02 ---
cat /workspace/src/contrib/pjdfstest/tests/utimensat/02.t >02.tmp
chmod +x 02.tmp
mv 02.tmp 02
--- 03 ---
cat /workspace/src/contrib/pjdfstest/tests/utimensat/03.t >03.tmp
chmod +x 03.tmp
mv 03.tmp 03
--- 04 ---
cat /workspace/src/contrib/pjdfstest/tests/utimensat/04.t >04.tmp
chmod +x 04.tmp
mv 04.tmp 04
--- 05 ---
--- all_subdir_tests/sys/capsicum ---
--- functional ---
--- all_subdir_tests/sys/pjdfstest ---
cat /workspace/src/contrib/pjdfstest/tests/utimensat/05.t >05.tmp
--- all_subdir_tests/sys/capsicum ---
echo '#! /usr/libexec/atf-sh' > functional.tmp
cat /workspace/src/tests/sys/capsicum/functional.sh >>functional.tmp
--- all_subdir_tests/sys/pjdfstest ---
chmod +x 05.tmp
mv 05.tmp 05
--- all_subdir_tests/sys/capsicum ---
chmod +x functional.tmp
--- all_subdir_tests/sys/pjdfstest ---
--- 06 ---
--- all_subdir_tests/sys/capsicum ---
mv functional.tmp functional
--- all_subdir_tests/sys/pjdfstest ---
cat /workspace/src/contrib/pjdfstest/tests/utimensat/06.t >06.tmp
--- all_subdir_tests/sys/capsicum ---
--- Kyuafile ---
--- all_subdir_tests/sys/pjdfstest ---
chmod +x 06.tmp
--- all_subdir_usr.bin ---
--- .depend ---
--- all_subdir_tests ---
mv 06.tmp 06
--- all_subdir_usr.bin ---
echo logins.full: /tmp/obj/workspace/src/amd64.amd64/tmp/usr/lib/libc.a  >> .depend
--- logins.pieo ---
--- all_subdir_tests ---
--- all_subdir_tests/sys/capsicum ---
--- mini-me ---
--- all_subdir_tests/sys/pjdfstest ---
--- 07 ---
--- all_subdir_usr.bin ---
/usr/local/bin/x86_64-unknown-freebsd14.2-gcc14 --sysroot=/tmp/obj/workspace/src/amd64.amd64/tmp -B/usr/local/x86_64-unknown-freebsd14.2/bin/ -fpie -DPIC   -O2 -pipe -fno-common   -fPIE -g -MD  -MF.depend.logins.pieo -MTlogins.pieo -std=gnu17 -Wno-format-zero-length -fstack-protector-strong -Wsystem-headers -Werror -Wall -Wno-format-y2k -W -Wno-unused-parameter -Wmissing-prototypes -Wpointer-arith -Wreturn-type -Wcast-qual -Wwrite-strings -Wswitch -Wshadow -Wunused-parameter -Wcast-align -Wchar-subscripts -Wnested-externs -Wold-style-definition -Wno-pointer-sign -Wdate-time -Wno-error=address -Wno-error=array-bounds -Wno-error=attributes -Wno-error=bool-compare -Wno-error=cast-align -Wno-error=clobbered -Wno-error=deprecated-declarations -Wno-error=enum-compare -Wno-error=extra -Wno-error=logical-not-parentheses -Wno-error=strict-aliasing -Wno-error=uninitialized -Wno-error=unused-function -Wno-error=unused-value -Wno-error=empty-body -Wno-error=maybe-uninitialized -Wno-error=nonnull-compare -Wno-error=shift-negative-value -Wno-error=tautological-compare -Wno-error=unused-const-variable -Wno-error=bool-operation -Wno-error=deprecated -Wno-error=expansion-to-defined -Wno-error=format-overflow -Wno-error=format-truncation -Wno-error=implicit-fallthrough -Wno-error=int-in-bool-context -Wno-error=memset-elt-size -Wno-error=noexcept-type -Wno-error=nonnull -Wno-error=pointer-compare -Wno-error=stringop-overflow -Wno-error=aggressive-loop-optimizations -Wno-error=cast-function-type -Wno-error=catch-value -Wno-error=multistatement-macros -Wno-error=restrict -Wno-error=sizeof-pointer-memaccess -Wno-error=stringop-truncation -Wno-return-type         -c /workspace/src/usr.bin/logins/logins.c -o logins.pieo
--- all_subdir_tests ---
cat /workspace/src/contrib/pjdfstest/tests/utimensat/07.t >07.tmp
--- all_subdir_tests/sys/capsicum ---
(cd /workspace/src/tests/sys/capsicum &&  DEPENDFILE=.depend.mini-me  NO_SUBDIR=1 make -f /workspace/src/tests/sys/capsicum/Makefile _RECURSING_PROGS=t  PROG=mini-me )
--- all_subdir_tests/sys/pjdfstest ---
chmod +x 07.tmp
mv 07.tmp 07
--- 08 ---
cat /workspace/src/contrib/pjdfstest/tests/utimensat/08.t >08.tmp
chmod +x 08.tmp
mv 08.tmp 08
--- 09 ---
cat /workspace/src/contrib/pjdfstest/tests/utimensat/09.t >09.tmp
chmod +x 09.tmp
mv 09.tmp 09
--- Kyuafile ---
--- misc.sh ---
sed -e '\,maindir=,s,maindir=.*,maindir=`dirname $0`/../,' < /workspace/src/contrib/pjdfstest/tests/misc.sh > misc.sh.tmp
--- all_subdir_tests/sys/capsicum ---
--- .depend.mini-me ---
echo mini-me.full: /tmp/obj/workspace/src/amd64.amd64/tmp/usr/lib/libc.a  >> .depend.mini-me
--- all_subdir_tests/sys/pjdfstest ---
mv misc.sh.tmp misc.sh
--- all_subdir_tests/sys/capsicum ---
--- mini-me.o ---
/usr/local/bin/x86_64-unknown-freebsd14.2-gcc14 --sysroot=/tmp/obj/workspace/src/amd64.amd64/tmp -B/usr/local/x86_64-unknown-freebsd14.2/bin/  -O2 -pipe -fno-common   -I/workspace/src/tests -g -MD  -MF.depend.mini-me.mini-me.o -MTmini-me.o -std=gnu17 -Wno-format-zero-length -fstack-protector-strong -Wsystem-headers -Werror -Wall -Wno-format-y2k -W -Wno-unused-parameter -Wmissing-prototypes -Wpointer-arith -Wreturn-type -Wcast-qual -Wwrite-strings -Wswitch -Wshadow -Wunused-parameter -Wcast-align -Wchar-subscripts -Wnested-externs -Wold-style-definition -Wno-pointer-sign -Wdate-time -Wno-error=address -Wno-error=array-bounds -Wno-error=attributes -Wno-error=bool-compare -Wno-error=cast-align -Wno-error=clobbered -Wno-error=deprecated-declarations -Wno-error=enum-compare -Wno-error=extra -Wno-error=logical-not-parentheses -Wno-error=strict-aliasing -Wno-error=uninitialized -Wno-error=unused-function -Wno-error=unused-value -Wno-error=empty-body -Wno-error=maybe-uninitialized -Wno-error=nonnull-compare -Wno-error=shift-negative-value -Wno-error=tautological-compare -Wno-error=unused-const-variable -Wno-error=bool-operation -Wno-error=deprecated -Wno-error=expansion-to-defined -Wno-error=format-overflow -Wno-error=format-truncation -Wno-error=implicit-fallthrough -Wno-error=int-in-bool-context -Wno-error=memset-elt-size -Wno-error=noexcept-type -Wno-error=nonnull -Wno-error=pointer-compare -Wno-error=stringop-overflow -Wno-error=aggressive-loop-optimizations -Wno-error=cast-function-type -Wno-error=catch-value -Wno-error=multistatement-macros -Wno-error=restrict -Wno-error=sizeof-pointer-memaccess -Wno-error=stringop-truncation -Wno-return-type      -c /workspace/src/contrib/capsicum-test/mini-me.c -o mini-me.o
--- all_subdir_tests/sys/pjdfstest ---
--- Kyuafile ---
--- all_subdir_tests/sys/capsicum ---
--- mini-me.noexec ---
(cd /workspace/src/tests/sys/capsicum &&  DEPENDFILE=.depend.mini-me.noexec  NO_SUBDIR=1 make -f /workspace/src/tests/sys/capsicum/Makefile _RECURSING_PROGS=t  PROG=mini-me.noexec )
--- .depend.mini-me.noexec ---
echo mini-me.noexec.full: /tmp/obj/workspace/src/amd64.amd64/tmp/usr/lib/libc.a  >> .depend.mini-me.noexec
--- mini-me.noexec.full ---
/usr/local/bin/x86_64-unknown-freebsd14.2-gcc14 --sysroot=/tmp/obj/workspace/src/amd64.amd64/tmp -B/usr/local/x86_64-unknown-freebsd14.2/bin/ -O2 -pipe -fno-common -I/workspace/src/tests -g -std=gnu17 -Wno-format-zero-length -fstack-protector-strong -Wsystem-headers -Werror -Wall -Wno-format-y2k -W -Wno-unused-parameter -Wmissing-prototypes -Wpointer-arith -Wreturn-type -Wcast-qual -Wwrite-strings -Wswitch -Wshadow -Wunused-parameter -Wcast-align -Wchar-subscripts -Wnested-externs -Wold-style-definition -Wno-pointer-sign -Wdate-time -Wno-error=address -Wno-error=array-bounds -Wno-error=attributes -Wno-error=bool-compare -Wno-error=cast-align -Wno-error=clobbered -Wno-error=deprecated-declarations -Wno-error=enum-compare -Wno-error=extra -Wno-error=logical-not-parentheses -Wno-error=strict-aliasing -Wno-error=uninitialized -Wno-error=unused-function -Wno-error=unused-value -Wno-error=empty-body -Wno-error=maybe-uninitialized -Wno-error=nonnull-compare -Wno-error=shift-negative-value -Wno-error=tautological-compare -Wno-error=unused-const-variable -Wno-error=bool-operation -Wno-error=deprecated -Wno-error=expansion-to-defined -Wno-error=format-overflow -Wno-error=format-truncation -Wno-error=implicit-fallthrough -Wno-error=int-in-bool-context -Wno-error=memset-elt-size -Wno-error=noexcept-type -Wno-error=nonnull -Wno-error=pointer-compare -Wno-error=stringop-overflow -Wno-error=aggressive-loop-optimizations -Wno-error=cast-function-type -Wno-error=catch-value -Wno-error=multistatement-macros -Wno-error=restrict -Wno-error=sizeof-pointer-memaccess -Wno-error=stringop-truncation -Wno-return-type  -Wl,-zrelro -static -Wl,-znoexecstack  -o mini-me.noexec.full mini-me.o  
--- mini-me ---
--- mini-me.full ---
/usr/local/bin/x86_64-unknown-freebsd14.2-gcc14 --sysroot=/tmp/obj/workspace/src/amd64.amd64/tmp -B/usr/local/x86_64-unknown-freebsd14.2/bin/ -O2 -pipe -fno-common -I/workspace/src/tests -g -std=gnu17 -Wno-format-zero-length -fstack-protector-strong -Wsystem-headers -Werror -Wall -Wno-format-y2k -W -Wno-unused-parameter -Wmissing-prototypes -Wpointer-arith -Wreturn-type -Wcast-qual -Wwrite-strings -Wswitch -Wshadow -Wunused-parameter -Wcast-align -Wchar-subscripts -Wnested-externs -Wold-style-definition -Wno-pointer-sign -Wdate-time -Wno-error=address -Wno-error=array-bounds -Wno-error=attributes -Wno-error=bool-compare -Wno-error=cast-align -Wno-error=clobbered -Wno-error=deprecated-declarations -Wno-error=enum-compare -Wno-error=extra -Wno-error=logical-not-parentheses -Wno-error=strict-aliasing -Wno-error=uninitialized -Wno-error=unused-function -Wno-error=unused-value -Wno-error=empty-body -Wno-error=maybe-uninitialized -Wno-error=nonnull-compare -Wno-error=shift-negative-value -Wno-error=tautological-compare -Wno-error=unused-const-variable -Wno-error=bool-operation -Wno-error=deprecated -Wno-error=expansion-to-defined -Wno-error=format-overflow -Wno-error=format-truncation -Wno-error=implicit-fallthrough -Wno-error=int-in-bool-context -Wno-error=memset-elt-size -Wno-error=noexcept-type -Wno-error=nonnull -Wno-error=pointer-compare -Wno-error=stringop-overflow -Wno-error=aggressive-loop-optimizations -Wno-error=cast-function-type -Wno-error=catch-value -Wno-error=multistatement-macros -Wno-error=restrict -Wno-error=sizeof-pointer-memaccess -Wno-error=stringop-truncation -Wno-return-type  -Wl,-zrelro -static -Wl,-znoexecstack  -o mini-me.full mini-me.o  
--- all_subdir_lib ---
--- timer_create_test.full ---
/usr/local/bin/x86_64-unknown-freebsd14.2-gcc14 --sysroot=/tmp/obj/workspace/src/amd64.amd64/tmp -B/usr/local/x86_64-unknown-freebsd14.2/bin/ -O2 -pipe -fno-common -I/workspace/src/lib/libnetbsd -I/workspace/src/contrib/netbsd-tests -fPIE -g -std=gnu17 -Wno-format-zero-length -fstack-protector-strong -Wsystem-headers -Werror -Wall -Wno-format-y2k -Wno-uninitialized -Wno-pointer-sign -Wdate-time -Wno-error=address -Wno-error=array-bounds -Wno-error=attributes -Wno-error=bool-compare -Wno-error=cast-align -Wno-error=clobbered -Wno-error=deprecated-declarations -Wno-error=enum-compare -Wno-error=extra -Wno-error=logical-not-parentheses -Wno-error=strict-aliasing -Wno-error=uninitialized -Wno-error=unused-function -Wno-error=unused-value -Wno-error=empty-body -Wno-error=maybe-uninitialized -Wno-error=nonnull-compare -Wno-error=shift-negative-value -Wno-error=tautological-compare -Wno-error=unused-const-variable -Wno-error=bool-operation -Wno-error=deprecated -Wno-error=expansion-to-defined -Wno-error=format-overflow -Wno-error=format-truncation -Wno-error=implicit-fallthrough -Wno-error=int-in-bool-context -Wno-error=memset-elt-size -Wno-error=noexcept-type -Wno-error=nonnull -Wno-error=pointer-compare -Wno-error=stringop-overflow -Wno-error=aggressive-loop-optimizations -Wno-error=cast-function-type -Wno-error=catch-value -Wno-error=multistatement-macros -Wno-error=restrict -Wno-error=sizeof-pointer-memaccess -Wno-error=stringop-truncation -Wno-return-type -Wno-address-of-packed-member  -L/tmp/obj/workspace/src/amd64.amd64/lib/libnetbsd -Wl,-zrelro -pie -Wl,-znoexecstack  -o timer_create_test.full t_timer_create.pieo  -lprivateatf-c  -lrt -L/tmp/obj/workspace/src/amd64.amd64/lib/libnetbsd -lnetbsd_pie
--- timer_create_test.debug ---
/usr/local/x86_64-unknown-freebsd14.2/bin/objcopy --only-keep-debug timer_create_test.full timer_create_test.debug
--- timer_create_test ---
/usr/local/x86_64-unknown-freebsd14.2/bin/objcopy --strip-debug --add-gnu-debuglink=timer_create_test.debug  timer_create_test.full timer_create_test
--- truncate_test ---
(cd /workspace/src/lib/libc/tests/sys &&  DEPENDFILE=.depend.truncate_test  NO_SUBDIR=1 make -f /workspace/src/lib/libc/tests/sys/Makefile _RECURSING_PROGS=t  PROG=truncate_test )
--- .depend.truncate_test ---
echo truncate_test.full: /tmp/obj/workspace/src/amd64.amd64/tmp/usr/lib/libc.a /tmp/obj/workspace/src/amd64.amd64/tmp/usr/lib/libprivateatf-c.a /tmp/obj/workspace/src/amd64.amd64/lib/libnetbsd/libnetbsd_pie.a >> .depend.truncate_test
--- t_truncate.pieo ---
/usr/local/bin/x86_64-unknown-freebsd14.2-gcc14 --sysroot=/tmp/obj/workspace/src/amd64.amd64/tmp -B/usr/local/x86_64-unknown-freebsd14.2/bin/ -fpie -DPIC   -O2 -pipe -fno-common   -I/workspace/src/lib/libnetbsd -I/workspace/src/contrib/netbsd-tests -fPIE -g -MD  -MF.depend.truncate_test.t_truncate.pieo -MTt_truncate.pieo -std=gnu17 -Wno-format-zero-length -fstack-protector-strong -Wsystem-headers -Werror -Wall -Wno-format-y2k -Wno-uninitialized -Wno-pointer-sign -Wdate-time -Wno-error=address -Wno-error=array-bounds -Wno-error=attributes -Wno-error=bool-compare -Wno-error=cast-align -Wno-error=clobbered -Wno-error=deprecated-declarations -Wno-error=enum-compare -Wno-error=extra -Wno-error=logical-not-parentheses -Wno-error=strict-aliasing -Wno-error=uninitialized -Wno-error=unused-function -Wno-error=unused-value -Wno-error=empty-body -Wno-error=maybe-uninitialized -Wno-error=nonnull-compare -Wno-error=shift-negative-value -Wno-error=tautological-compare -Wno-error=unused-const-variable -Wno-error=bool-operation -Wno-error=deprecated -Wno-error=expansion-to-defined -Wno-error=format-overflow -Wno-error=format-truncation -Wno-error=implicit-fallthrough -Wno-error=int-in-bool-context -Wno-error=memset-elt-size -Wno-error=noexcept-type -Wno-error=nonnull -Wno-error=pointer-compare -Wno-error=stringop-overflow -Wno-error=aggressive-loop-optimizations -Wno-error=cast-function-type -Wno-error=catch-value -Wno-error=multistatement-macros -Wno-error=restrict -Wno-error=sizeof-pointer-memaccess -Wno-error=stringop-truncation -Wno-return-type -Wno-address-of-packed-member      -c /workspace/src/contrib/netbsd-tests/lib/libc/sys/t_truncate.c -o t_truncate.pieo
--- all_subdir_tests ---
--- mini-me.noexec ---
/usr/local/bin/x86_64-unknown-freebsd14.2-ld: /tmp/obj/workspace/src/amd64.amd64/tmp/usr/lib/crt1.o: in function `_start':
/workspace/src/lib/csu/amd64/crt1_s.S:66:(.text+0x17): undefined reference to `main'
--- all_subdir_usr.bin ---
--- logins.full ---
/usr/local/bin/x86_64-unknown-freebsd14.2-gcc14 --sysroot=/tmp/obj/workspace/src/amd64.amd64/tmp -B/usr/local/x86_64-unknown-freebsd14.2/bin/ -O2 -pipe -fno-common -fPIE -g -std=gnu17 -Wno-format-zero-length -fstack-protector-strong -Wsystem-headers -Werror -Wall -Wno-format-y2k -W -Wno-unused-parameter -Wmissing-prototypes -Wpointer-arith -Wreturn-type -Wcast-qual -Wwrite-strings -Wswitch -Wshadow -Wunused-parameter -Wcast-align -Wchar-subscripts -Wnested-externs -Wold-style-definition -Wno-pointer-sign -Wdate-time -Wno-error=address -Wno-error=array-bounds -Wno-error=attributes -Wno-error=bool-compare -Wno-error=cast-align -Wno-error=clobbered -Wno-error=deprecated-declarations -Wno-error=enum-compare -Wno-error=extra -Wno-error=logical-not-parentheses -Wno-error=strict-aliasing -Wno-error=uninitialized -Wno-error=unused-function -Wno-error=unused-value -Wno-error=empty-body -Wno-error=maybe-uninitialized -Wno-error=nonnull-compare -Wno-error=shift-negative-value -Wno-error=tautological-compare -Wno-error=unused-const-variable -Wno-error=bool-operation -Wno-error=deprecated -Wno-error=expansion-to-defined -Wno-error=format-overflow -Wno-error=format-truncation -Wno-error=implicit-fallthrough -Wno-error=int-in-bool-context -Wno-error=memset-elt-size -Wno-error=noexcept-type -Wno-error=nonnull -Wno-error=pointer-compare -Wno-error=stringop-overflow -Wno-error=aggressive-loop-optimizations -Wno-error=cast-function-type -Wno-error=catch-value -Wno-error=multistatement-macros -Wno-error=restrict -Wno-error=sizeof-pointer-memaccess -Wno-error=stringop-truncation -Wno-return-type  -Wl,-zrelro -pie -Wl,-znoexecstack   -o logins.full logins.pieo  
--- logins.1.gz ---
gzip -cn /workspace/src/usr.bin/logins/logins.1 > logins.1.gz
--- logins.debug ---
--- all_subdir_tests ---
collect2: error: ld returned 1 exit status
--- all_subdir_usr.bin ---
/usr/local/x86_64-unknown-freebsd14.2/bin/objcopy --only-keep-debug logins.full logins.debug
--- all_subdir_tests ---
*** [mini-me.noexec.full] Error code 1

make[6]: stopped in /workspace/src/tests/sys/capsicum
      119.79 real       395.10 user        40.07 sys

make[1]: stopped in /workspace/src

make: stopped in /workspace/src
Build step 'Execute shell' marked build as failure
[WARNINGS]Skipping publisher since build result is FAILURE
[PostBuildScript] - [INFO] Executing post build scripts.
[FreeBSD-main-amd64-gcc14_build] $ /bin/sh -xe /tmp/jenkins5040793373020612037.sh
+ sh freebsd-ci/scripts/jail/clean.sh
clean jail FreeBSD-main-amd64-gcc14_build
Checking for post-build
Performing post-build step
Checking if email needs to be generated
Email was triggered for: Failure - Any
Sending email for trigger: Failure - Any
Sending mail from default account using System Admin e-mail address