FreeBSD-stable-15-amd64-gcc12_build - Build #287 - Still Failing

From: <jenkins-admin_at_FreeBSD.org>
Date: Sat, 29 Nov 2025 00:52:45 UTC
FreeBSD-stable-15-amd64-gcc12_build - Build #287 (283162be308e05f6a55c0a76f2f89891aea5f754) - Still Failing

Build information: https://ci.FreeBSD.org/job/FreeBSD-stable-15-amd64-gcc12_build/287/
Full change log: https://ci.FreeBSD.org/job/FreeBSD-stable-15-amd64-gcc12_build/287/changes
Full build log: https://ci.FreeBSD.org/job/FreeBSD-stable-15-amd64-gcc12_build/287/console

Status explanation:
"Failure" - the build is suspected being broken by the following changes
"Still Failing" - the build has not been fixed by the following changes and
                  this is a notification to note that these changes have
                  not been fully tested by the CI system

Change summaries:
(Those commits are likely but not certainly responsible)

18e83edd13786718b8c2528b540c91c36275f234 by kgalazka:
igb(4): Fix VLAN support on VFs

0224c9f6d0f3454cc6ffc82d2f6079f5924ac9d6 by kgalazka:
ix(4): Add support for debug dump for E610 adapters

283162be308e05f6a55c0a76f2f89891aea5f754 by kgalazka:
ix.4: Document E610 debug dump



The end of the build log:

[...truncated 100.83 MiB...]
--- Kyuafile ---
--- misc.sh ---
sed -e '\,maindir=,s,maindir=.*,maindir=`dirname $0`/../,' < /workspace/src/contrib/pjdfstest/tests/misc.sh > misc.sh.tmp
mv misc.sh.tmp misc.sh
--- Kyuafile ---
--- all_subdir_tests/sys/audit ---
--- file-attribute-modify ---
(cd /workspace/src/tests/sys/audit &&  DEPENDFILE=.depend.file-attribute-modify  NO_SUBDIR=1 make -f /workspace/src/tests/sys/audit/Makefile _RECURSING_PROGS=t  PROG=file-attribute-modify )
--- all_subdir_usr.sbin ---
--- kernel.pieo ---
--- all_subdir_tests ---
--- all_subdir_tests/sys/aio ---
--- lio_test ---
--- all_subdir_usr.sbin ---
/usr/local/bin/x86_64-unknown-freebsd14.3-g++12  --sysroot=/tmp/obj/workspace/src/amd64.amd64/tmp -B/usr/local/x86_64-unknown-freebsd14.3/bin/ -fpie  -O2 -pipe -fno-common -I/workspace/src/contrib/libucl/include -I/workspace/src/usr.sbin/ctld -I/workspace/src/sys -I/workspace/src/sys/cam/ctl -I/workspace/src/sys/dev/iscsi -I/workspace/src/lib/libiscsiutil -I/workspace/src/lib/libutil++ -I/workspace/src/lib/libnvmf -fPIE -ffile-prefix-map=/workspace/src=/usr/src -ffile-prefix-map=/tmp/obj/workspace/src=/usr/obj -g -MD -MF.depend.kernel.pieo -MTkernel.pieo -Wno-format-zero-length -fstack-protector-strong -Wsystem-headers -Werror -Wall -Wno-format-y2k -W -Wno-unused-parameter -Wpointer-arith -Wreturn-type -Wcast-qual -Wwrite-strings -Wswitch -Wshadow -Wunused-parameter -Wchar-subscripts -Wdate-time -Wno-error=address -Wno-error=array-bounds -Wno-error=attributes -Wno-error=bool-compare -Wno-error=cast-align -Wno-error=clobbered -Wno-error=deprecated-declarations -Wno-error=enum-compare -Wno-error=extra -Wno-error=logical-not-parentheses -Wno-error=strict-aliasing -Wno-error=uninitialized -Wno-error=unused-function -Wno-error=unused-value -Wno-error=empty-body -Wno-error=maybe-uninitialized -Wno-error=nonnull-compare -Wno-error=shift-negative-value -Wno-error=tautological-compare -Wno-error=unused-const-variable -Wno-error=bool-operation -Wno-error=deprecated -Wno-error=expansion-to-defined -Wno-error=format-overflow -Wno-error=format-truncation -Wno-error=implicit-fallthrough -Wno-error=int-in-bool-context -Wno-error=memset-elt-size -Wno-error=noexcept-type -Wno-error=nonnull -Wno-error=pointer-compare -Wno-error=stringop-overflow -Wno-error=aggressive-loop-optimizations -Wno-error=cast-function-type -Wno-error=catch-value -Wno-error=multistatement-macros -Wno-error=restrict -Wno-error=sizeof-pointer-memaccess -Wno-error=stringop-truncation -Wno-return-type   -fPIE -ffile-prefix-map=/workspace/src=/usr/src -ffile-prefix-map=/tmp/obj/workspace/src=/usr/obj -g -std=gnu++17 -Wno-error=class-memaccess -Wno-literal-suffix -Wno-error=unknown-pragmas -Wno-shadow       -c /workspace/src/usr.sbin/ctld/kernel.cc -o kernel.pieo
--- all_subdir_tests ---
(cd /workspace/src/tests/sys/aio &&  DEPENDFILE=.depend.lio_test  NO_SUBDIR=1 make -f /workspace/src/tests/sys/aio/Makefile _RECURSING_PROGS=t  PROG=lio_test )
--- .depend.lio_test ---
echo lio_test.full: /tmp/obj/workspace/src/amd64.amd64/tmp/usr/lib/libc.a /tmp/obj/workspace/src/amd64.amd64/tmp/usr/lib/libprivateatf-c.a /tmp/obj/workspace/src/amd64.amd64/tmp/usr/lib/librt.a >> .depend.lio_test
--- lio_test.pieo ---
/usr/local/bin/x86_64-unknown-freebsd14.3-gcc12 --sysroot=/tmp/obj/workspace/src/amd64.amd64/tmp -B/usr/local/x86_64-unknown-freebsd14.3/bin/ -fpie -DPIC   -O2 -pipe -fno-common -I/workspace/src/tests   -fPIE -ffile-prefix-map=/workspace/src=/usr/src -ffile-prefix-map=/tmp/obj/workspace/src=/usr/obj -g -MD  -MF.depend.lio_test.lio_test.pieo -MTlio_test.pieo -std=gnu17 -Wno-format-zero-length -fstack-protector-strong -Wsystem-headers -Werror -Wall -Wno-format-y2k -W -Wno-unused-parameter -Wmissing-prototypes -Wpointer-arith -Wreturn-type -Wcast-qual -Wwrite-strings -Wswitch -Wshadow -Wunused-parameter -Wcast-align -Wchar-subscripts -Wnested-externs -Wold-style-definition -Wno-pointer-sign -Wdate-time -Wno-error=address -Wno-error=array-bounds -Wno-error=attributes -Wno-error=bool-compare -Wno-error=cast-align -Wno-error=clobbered -Wno-error=deprecated-declarations -Wno-error=enum-compare -Wno-error=extra -Wno-error=logical-not-parentheses -Wno-error=strict-aliasing -Wno-error=uninitialized -Wno-error=unused-function -Wno-error=unused-value -Wno-error=empty-body -Wno-error=maybe-uninitialized -Wno-error=nonnull-compare -Wno-error=shift-negative-value -Wno-error=tautological-compare -Wno-error=unused-const-variable -Wno-error=bool-operation -Wno-error=deprecated -Wno-error=expansion-to-defined -Wno-error=format-overflow -Wno-error=format-truncation -Wno-error=implicit-fallthrough -Wno-error=int-in-bool-context -Wno-error=memset-elt-size -Wno-error=noexcept-type -Wno-error=nonnull -Wno-error=pointer-compare -Wno-error=stringop-overflow -Wno-error=aggressive-loop-optimizations -Wno-error=cast-function-type -Wno-error=catch-value -Wno-error=multistatement-macros -Wno-error=restrict -Wno-error=sizeof-pointer-memaccess -Wno-error=stringop-truncation -Wno-return-type       -c /workspace/src/tests/sys/aio/lio_test.c -o lio_test.pieo
--- all_subdir_tests/sys/audit ---
--- .depend.file-attribute-modify ---
echo file-attribute-modify.full: /tmp/obj/workspace/src/amd64.amd64/tmp/usr/lib/libc.a /tmp/obj/workspace/src/amd64.amd64/tmp/usr/lib/libprivateatf-c.a >> .depend.file-attribute-modify
--- file-attribute-modify.o ---
/usr/local/bin/x86_64-unknown-freebsd14.3-gcc12 --sysroot=/tmp/obj/workspace/src/amd64.amd64/tmp -B/usr/local/x86_64-unknown-freebsd14.3/bin/  -O2 -pipe -fno-common -I/workspace/src/contrib/openbsm   -ffile-prefix-map=/workspace/src=/usr/src -ffile-prefix-map=/tmp/obj/workspace/src=/usr/obj -g -MD  -MF.depend.file-attribute-modify.file-attribute-modify.o -MTfile-attribute-modify.o -std=gnu17 -Wno-format-zero-length -fstack-protector-strong -Wsystem-headers -Werror -Wall -Wno-format-y2k -W -Wno-unused-parameter -Wmissing-prototypes -Wpointer-arith -Wreturn-type -Wcast-qual -Wwrite-strings -Wswitch -Wshadow -Wunused-parameter -Wcast-align -Wchar-subscripts -Wnested-externs -Wold-style-definition -Wno-pointer-sign -Wdate-time -Wno-error=address -Wno-error=array-bounds -Wno-error=attributes -Wno-error=bool-compare -Wno-error=cast-align -Wno-error=clobbered -Wno-error=deprecated-declarations -Wno-error=enum-compare -Wno-error=extra -Wno-error=logical-not-parentheses -Wno-error=strict-aliasing -Wno-error=uninitialized -Wno-error=unused-function -Wno-error=unused-value -Wno-error=empty-body -Wno-error=maybe-uninitialized -Wno-error=nonnull-compare -Wno-error=shift-negative-value -Wno-error=tautological-compare -Wno-error=unused-const-variable -Wno-error=bool-operation -Wno-error=deprecated -Wno-error=expansion-to-defined -Wno-error=format-overflow -Wno-error=format-truncation -Wno-error=implicit-fallthrough -Wno-error=int-in-bool-context -Wno-error=memset-elt-size -Wno-error=noexcept-type -Wno-error=nonnull -Wno-error=pointer-compare -Wno-error=stringop-overflow -Wno-error=aggressive-loop-optimizations -Wno-error=cast-function-type -Wno-error=catch-value -Wno-error=multistatement-macros -Wno-error=restrict -Wno-error=sizeof-pointer-memaccess -Wno-error=stringop-truncation -Wno-return-type      -c /workspace/src/tests/sys/audit/file-attribute-modify.c -o file-attribute-modify.o
--- file-attribute-access ---
--- file-attribute-access.full ---
/usr/local/bin/x86_64-unknown-freebsd14.3-gcc12 --sysroot=/tmp/obj/workspace/src/amd64.amd64/tmp -B/usr/local/x86_64-unknown-freebsd14.3/bin/ -O2 -pipe -fno-common -I/workspace/src/contrib/openbsm -ffile-prefix-map=/workspace/src=/usr/src -ffile-prefix-map=/tmp/obj/workspace/src=/usr/obj -g -std=gnu17 -Wno-format-zero-length -fstack-protector-strong -Wsystem-headers -Werror -Wall -Wno-format-y2k -W -Wno-unused-parameter -Wmissing-prototypes -Wpointer-arith -Wreturn-type -Wcast-qual -Wwrite-strings -Wswitch -Wshadow -Wunused-parameter -Wcast-align -Wchar-subscripts -Wnested-externs -Wold-style-definition -Wno-pointer-sign -Wdate-time -Wno-error=address -Wno-error=array-bounds -Wno-error=attributes -Wno-error=bool-compare -Wno-error=cast-align -Wno-error=clobbered -Wno-error=deprecated-declarations -Wno-error=enum-compare -Wno-error=extra -Wno-error=logical-not-parentheses -Wno-error=strict-aliasing -Wno-error=uninitialized -Wno-error=unused-function -Wno-error=unused-value -Wno-error=empty-body -Wno-error=maybe-uninitialized -Wno-error=nonnull-compare -Wno-error=shift-negative-value -Wno-error=tautological-compare -Wno-error=unused-const-variable -Wno-error=bool-operation -Wno-error=deprecated -Wno-error=expansion-to-defined -Wno-error=format-overflow -Wno-error=format-truncation -Wno-error=implicit-fallthrough -Wno-error=int-in-bool-context -Wno-error=memset-elt-size -Wno-error=noexcept-type -Wno-error=nonnull -Wno-error=pointer-compare -Wno-error=stringop-overflow -Wno-error=aggressive-loop-optimizations -Wno-error=cast-function-type -Wno-error=catch-value -Wno-error=multistatement-macros -Wno-error=restrict -Wno-error=sizeof-pointer-memaccess -Wno-error=stringop-truncation -Wno-return-type  -lbsm -lutil -Wl,-zrelro -Wl,-znoexecstack  -o file-attribute-access.full file-attribute-access.o utils.o  /tmp/obj/workspace/src/amd64.amd64/tmp/usr/lib/libprivateauditd.a -lprivateatf-c
--- file-attribute-access.debug ---
/usr/local/x86_64-unknown-freebsd14.3/bin/objcopy --only-keep-debug file-attribute-access.full file-attribute-access.debug
--- file-attribute-access ---
/usr/local/x86_64-unknown-freebsd14.3/bin/objcopy --strip-debug --add-gnu-debuglink=file-attribute-access.debug  file-attribute-access.full file-attribute-access
--- all_subdir_tests/sys/cam ---
===> tests/sys/cam (all)
--- all_subdir_tests/sys/aio ---
--- aio_test ---
--- aio_test.full ---
/usr/local/bin/x86_64-unknown-freebsd14.3-gcc12 --sysroot=/tmp/obj/workspace/src/amd64.amd64/tmp -B/usr/local/x86_64-unknown-freebsd14.3/bin/ -O2 -pipe -fno-common -I/workspace/src/tests -fPIE -ffile-prefix-map=/workspace/src=/usr/src -ffile-prefix-map=/tmp/obj/workspace/src=/usr/obj -g -std=gnu17 -Wno-format-zero-length -fstack-protector-strong -Wsystem-headers -Werror -Wall -Wno-format-y2k -W -Wno-unused-parameter -Wmissing-prototypes -Wpointer-arith -Wreturn-type -Wcast-qual -Wwrite-strings -Wswitch -Wshadow -Wunused-parameter -Wcast-align -Wchar-subscripts -Wnested-externs -Wold-style-definition -Wno-pointer-sign -Wdate-time -Wno-error=address -Wno-error=array-bounds -Wno-error=attributes -Wno-error=bool-compare -Wno-error=cast-align -Wno-error=clobbered -Wno-error=deprecated-declarations -Wno-error=enum-compare -Wno-error=extra -Wno-error=logical-not-parentheses -Wno-error=strict-aliasing -Wno-error=uninitialized -Wno-error=unused-function -Wno-error=unused-value -Wno-error=empty-body -Wno-error=maybe-uninitialized -Wno-error=nonnull-compare -Wno-error=shift-negative-value -Wno-error=tautological-compare -Wno-error=unused-const-variable -Wno-error=bool-operation -Wno-error=deprecated -Wno-error=expansion-to-defined -Wno-error=format-overflow -Wno-error=format-truncation -Wno-error=implicit-fallthrough -Wno-error=int-in-bool-context -Wno-error=memset-elt-size -Wno-error=noexcept-type -Wno-error=nonnull -Wno-error=pointer-compare -Wno-error=stringop-overflow -Wno-error=aggressive-loop-optimizations -Wno-error=cast-function-type -Wno-error=catch-value -Wno-error=multistatement-macros -Wno-error=restrict -Wno-error=sizeof-pointer-memaccess -Wno-error=stringop-truncation -Wno-return-type  -Wl,-zrelro -pie -Wl,-znoexecstack  -o aio_test.full aio_test.pieo  -lprivateatf-c  -lutil  -lrt
--- all_subdir_tests/sys/cam ---
--- all_subdir_tests/sys/cam/ctl ---
===> tests/sys/cam/ctl (all)
--- all_subdir_tests/sys/aio ---
/usr/local/bin/x86_64-unknown-freebsd14.3-ld: aio_test.pieo: in function `atfu_aio_socket_listen_pending_body':
/usr/src/tests/sys/aio/aio_test.c:1324:(.text+0x1bbb): warning: warning: mktemp() possibly used unsafely; consider using mkstemp()
--- all_subdir_tests/sys/cam ---
--- prout_register_huge_cdb ---
(cd /workspace/src/tests/sys/cam/ctl &&  DEPENDFILE=.depend.prout_register_huge_cdb  NO_SUBDIR=1 make -f /workspace/src/tests/sys/cam/ctl/Makefile _RECURSING_PROGS=t  PROG=prout_register_huge_cdb )
--- all_subdir_tests/sys/aio ---
--- aio_test.debug ---
/usr/local/x86_64-unknown-freebsd14.3/bin/objcopy --only-keep-debug aio_test.full aio_test.debug
--- aio_test ---
/usr/local/x86_64-unknown-freebsd14.3/bin/objcopy --strip-debug --add-gnu-debuglink=aio_test.debug  aio_test.full aio_test
--- all_subdir_tests/sys/cam ---
--- Kyuafile ---
--- all_subdir_rescue ---
--- xz_make ---
--- coder.o ---
/usr/local/bin/x86_64-unknown-freebsd14.3-gcc12 --sysroot=/tmp/obj/workspace/src/amd64.amd64/tmp -B/usr/local/x86_64-unknown-freebsd14.3/bin/  -O2 -pipe -fno-common   -DHAVE_CONFIG_H  -I/workspace/src/lib/liblzma  -I/workspace/src/contrib/xz/src/common -DRESCUE -I/tmp/obj/workspace/src/amd64.amd64/lib/libifconfig -I/tmp/obj/workspace/src/amd64.amd64/lib/libiscsiutil -ffile-prefix-map=/workspace/src=/usr/src -ffile-prefix-map=/tmp/obj/workspace/src/amd64.amd64/rescue/rescue/workspace/src=/usr/obj -g -MD  -MF.depend.coder.o -MTcoder.o -std=gnu17 -Wno-format-zero-length -fstack-protector-strong -Wsystem-headers -Werror -Wall -Wno-format-y2k -W -Wno-unused-parameter -Wmissing-prototypes -Wpointer-arith -Wno-uninitialized -Wno-pointer-sign -Wdate-time -Wno-error=address -Wno-error=array-bounds -Wno-error=attributes -Wno-error=bool-compare -Wno-error=cast-align -Wno-error=clobbered -Wno-error=deprecated-declarations -Wno-error=enum-compare -Wno-error=extra -Wno-error=logical-not-parentheses -Wno-error=strict-aliasing -Wno-error=uninitialized -Wno-error=unused-function -Wno-error=unused-value -Wno-error=empty-body -Wno-error=maybe-uninitialized -Wno-error=nonnull-compare -Wno-error=shift-negative-value -Wno-error=tautological-compare -Wno-error=unused-const-variable -Wno-error=bool-operation -Wno-error=deprecated -Wno-error=expansion-to-defined -Wno-error=format-overflow -Wno-error=format-truncation -Wno-error=implicit-fallthrough -Wno-error=int-in-bool-context -Wno-error=memset-elt-size -Wno-error=noexcept-type -Wno-error=nonnull -Wno-error=pointer-compare -Wno-error=stringop-overflow -Wno-error=aggressive-loop-optimizations -Wno-error=cast-function-type -Wno-error=catch-value -Wno-error=multistatement-macros -Wno-error=restrict -Wno-error=sizeof-pointer-memaccess -Wno-error=stringop-truncation -Wno-return-type -Wno-address-of-packed-member       -c /workspace/src/contrib/xz/src/xz/coder.c -o coder.o
--- all_subdir_tests ---
--- all_subdir_tests/sys/cam/ctl ---
--- .depend.prout_register_huge_cdb ---
echo prout_register_huge_cdb.full: /tmp/obj/workspace/src/amd64.amd64/tmp/usr/lib/libc.a /tmp/obj/workspace/src/amd64.amd64/tmp/usr/lib/libcam.a >> .depend.prout_register_huge_cdb
--- prout_register_huge_cdb.pieo ---
/usr/local/bin/x86_64-unknown-freebsd14.3-gcc12 --sysroot=/tmp/obj/workspace/src/amd64.amd64/tmp -B/usr/local/x86_64-unknown-freebsd14.3/bin/ -fpie -DPIC   -O2 -pipe -fno-common -I/workspace/src/sys   -fPIE -ffile-prefix-map=/workspace/src=/usr/src -ffile-prefix-map=/tmp/obj/workspace/src=/usr/obj -g -MD  -MF.depend.prout_register_huge_cdb.prout_register_huge_cdb.pieo -MTprout_register_huge_cdb.pieo -std=gnu17 -Wno-format-zero-length -fstack-protector-strong -Wsystem-headers -Werror -Wall -Wno-format-y2k -W -Wno-unused-parameter -Wmissing-prototypes -Wpointer-arith -Wreturn-type -Wcast-qual -Wwrite-strings -Wswitch -Wshadow -Wunused-parameter -Wcast-align -Wchar-subscripts -Wnested-externs -Wold-style-definition -Wno-pointer-sign -Wdate-time -Wno-error=address -Wno-error=array-bounds -Wno-error=attributes -Wno-error=bool-compare -Wno-error=cast-align -Wno-error=clobbered -Wno-error=deprecated-declarations -Wno-error=enum-compare -Wno-error=extra -Wno-error=logical-not-parentheses -Wno-error=strict-aliasing -Wno-error=uninitialized -Wno-error=unused-function -Wno-error=unused-value -Wno-error=empty-body -Wno-error=maybe-uninitialized -Wno-error=nonnull-compare -Wno-error=shift-negative-value -Wno-error=tautological-compare -Wno-error=unused-const-variable -Wno-error=bool-operation -Wno-error=deprecated -Wno-error=expansion-to-defined -Wno-error=format-overflow -Wno-error=format-truncation -Wno-error=implicit-fallthrough -Wno-error=int-in-bool-context -Wno-error=memset-elt-size -Wno-error=noexcept-type -Wno-error=nonnull -Wno-error=pointer-compare -Wno-error=stringop-overflow -Wno-error=aggressive-loop-optimizations -Wno-error=cast-function-type -Wno-error=catch-value -Wno-error=multistatement-macros -Wno-error=restrict -Wno-error=sizeof-pointer-memaccess -Wno-error=stringop-truncation -Wno-return-type       -c /workspace/src/tests/sys/cam/ctl/prout_register_huge_cdb.c -o prout_register_huge_cdb.pieo
--- all_subdir_tests/sys/aio ---
--- lio_test ---
--- lio_test.full ---
/usr/local/bin/x86_64-unknown-freebsd14.3-gcc12 --sysroot=/tmp/obj/workspace/src/amd64.amd64/tmp -B/usr/local/x86_64-unknown-freebsd14.3/bin/ -O2 -pipe -fno-common -I/workspace/src/tests -fPIE -ffile-prefix-map=/workspace/src=/usr/src -ffile-prefix-map=/tmp/obj/workspace/src=/usr/obj -g -std=gnu17 -Wno-format-zero-length -fstack-protector-strong -Wsystem-headers -Werror -Wall -Wno-format-y2k -W -Wno-unused-parameter -Wmissing-prototypes -Wpointer-arith -Wreturn-type -Wcast-qual -Wwrite-strings -Wswitch -Wshadow -Wunused-parameter -Wcast-align -Wchar-subscripts -Wnested-externs -Wold-style-definition -Wno-pointer-sign -Wdate-time -Wno-error=address -Wno-error=array-bounds -Wno-error=attributes -Wno-error=bool-compare -Wno-error=cast-align -Wno-error=clobbered -Wno-error=deprecated-declarations -Wno-error=enum-compare -Wno-error=extra -Wno-error=logical-not-parentheses -Wno-error=strict-aliasing -Wno-error=uninitialized -Wno-error=unused-function -Wno-error=unused-value -Wno-error=empty-body -Wno-error=maybe-uninitialized -Wno-error=nonnull-compare -Wno-error=shift-negative-value -Wno-error=tautological-compare -Wno-error=unused-const-variable -Wno-error=bool-operation -Wno-error=deprecated -Wno-error=expansion-to-defined -Wno-error=format-overflow -Wno-error=format-truncation -Wno-error=implicit-fallthrough -Wno-error=int-in-bool-context -Wno-error=memset-elt-size -Wno-error=noexcept-type -Wno-error=nonnull -Wno-error=pointer-compare -Wno-error=stringop-overflow -Wno-error=aggressive-loop-optimizations -Wno-error=cast-function-type -Wno-error=catch-value -Wno-error=multistatement-macros -Wno-error=restrict -Wno-error=sizeof-pointer-memaccess -Wno-error=stringop-truncation -Wno-return-type  -Wl,-zrelro -pie -Wl,-znoexecstack  -o lio_test.full lio_test.pieo  -lprivateatf-c  -lrt
--- lio_test.debug ---
/usr/local/x86_64-unknown-freebsd14.3/bin/objcopy --only-keep-debug lio_test.full lio_test.debug
--- lio_test ---
/usr/local/x86_64-unknown-freebsd14.3/bin/objcopy --strip-debug --add-gnu-debuglink=lio_test.debug  lio_test.full lio_test
--- Kyuafile ---
--- all_subdir_tests/sys/capsicum ---
===> tests/sys/capsicum (all)
--- mini-me.pieo ---
/usr/local/bin/x86_64-unknown-freebsd14.3-gcc12 --sysroot=/tmp/obj/workspace/src/amd64.amd64/tmp -B/usr/local/x86_64-unknown-freebsd14.3/bin/ -fpie -DPIC   -O2 -pipe -fno-common   -I/workspace/src/tests -fPIE -ffile-prefix-map=/workspace/src=/usr/src -ffile-prefix-map=/tmp/obj/workspace/src=/usr/obj -g  -std=gnu17 -Wno-format-zero-length -fstack-protector-strong -Wsystem-headers -Werror -Wall -Wno-format-y2k -W -Wno-unused-parameter -Wmissing-prototypes -Wpointer-arith -Wreturn-type -Wcast-qual -Wwrite-strings -Wswitch -Wshadow -Wunused-parameter -Wcast-align -Wchar-subscripts -Wnested-externs -Wold-style-definition -Wno-pointer-sign -Wdate-time -Wno-error=address -Wno-error=array-bounds -Wno-error=attributes -Wno-error=bool-compare -Wno-error=cast-align -Wno-error=clobbered -Wno-error=deprecated-declarations -Wno-error=enum-compare -Wno-error=extra -Wno-error=logical-not-parentheses -Wno-error=strict-aliasing -Wno-error=uninitialized -Wno-error=unused-function -Wno-error=unused-value -Wno-error=empty-body -Wno-error=maybe-uninitialized -Wno-error=nonnull-compare -Wno-error=shift-negative-value -Wno-error=tautological-compare -Wno-error=unused-const-variable -Wno-error=bool-operation -Wno-error=deprecated -Wno-error=expansion-to-defined -Wno-error=format-overflow -Wno-error=format-truncation -Wno-error=implicit-fallthrough -Wno-error=int-in-bool-context -Wno-error=memset-elt-size -Wno-error=noexcept-type -Wno-error=nonnull -Wno-error=pointer-compare -Wno-error=stringop-overflow -Wno-error=aggressive-loop-optimizations -Wno-error=cast-function-type -Wno-error=catch-value -Wno-error=multistatement-macros -Wno-error=restrict -Wno-error=sizeof-pointer-memaccess -Wno-error=stringop-truncation -Wno-return-type         -c /workspace/src/contrib/capsicum-test/mini-me.c -o mini-me.pieo
--- functional ---
echo '#! /usr/libexec/atf-sh' > functional.tmp
cat /workspace/src/tests/sys/capsicum/functional.sh >>functional.tmp
chmod +x functional.tmp
mv functional.tmp functional
--- Kyuafile ---
--- mini-me ---
(cd /workspace/src/tests/sys/capsicum &&  DEPENDFILE=.depend.mini-me  NO_SUBDIR=1 make -f /workspace/src/tests/sys/capsicum/Makefile _RECURSING_PROGS=t  PROG=mini-me )
--- all_subdir_rescue ---
--- less_make ---
--- command.o ---
/usr/local/bin/x86_64-unknown-freebsd14.3-gcc12 --sysroot=/tmp/obj/workspace/src/amd64.amd64/tmp -B/usr/local/x86_64-unknown-freebsd14.3/bin/  -O2 -pipe -fno-common -I/workspace/src/usr.bin/less -I/workspace/src/contrib/less   -DRESCUE -I/tmp/obj/workspace/src/amd64.amd64/lib/libifconfig -I/tmp/obj/workspace/src/amd64.amd64/lib/libiscsiutil -ffile-prefix-map=/workspace/src=/usr/src -ffile-prefix-map=/tmp/obj/workspace/src/amd64.amd64/rescue/rescue/workspace/src=/usr/obj -g -MD  -MF.depend.command.o -MTcommand.o -std=gnu17 -Wno-format-zero-length -fstack-protector-strong -Wsystem-headers -Werror -Wno-pointer-sign -Wdate-time -Wno-error=address -Wno-error=array-bounds -Wno-error=attributes -Wno-error=bool-compare -Wno-error=cast-align -Wno-error=clobbered -Wno-error=deprecated-declarations -Wno-error=enum-compare -Wno-error=extra -Wno-error=logical-not-parentheses -Wno-error=strict-aliasing -Wno-error=uninitialized -Wno-error=unused-function -Wno-error=unused-value -Wno-error=empty-body -Wno-error=maybe-uninitialized -Wno-error=nonnull-compare -Wno-error=shift-negative-value -Wno-error=tautological-compare -Wno-error=unused-const-variable -Wno-error=bool-operation -Wno-error=deprecated -Wno-error=expansion-to-defined -Wno-error=format-overflow -Wno-error=format-truncation -Wno-error=implicit-fallthrough -Wno-error=int-in-bool-context -Wno-error=memset-elt-size -Wno-error=noexcept-type -Wno-error=nonnull -Wno-error=pointer-compare -Wno-error=stringop-overflow -Wno-error=aggressive-loop-optimizations -Wno-error=cast-function-type -Wno-error=catch-value -Wno-error=multistatement-macros -Wno-error=restrict -Wno-error=sizeof-pointer-memaccess -Wno-error=stringop-truncation -Wno-return-type -Wno-address-of-packed-member       -c /workspace/src/contrib/less/command.c -o command.o
--- all_subdir_tests ---
--- all_subdir_tests/sys/cam ---
--- prout_register_huge_cdb.full ---
/usr/local/bin/x86_64-unknown-freebsd14.3-gcc12 --sysroot=/tmp/obj/workspace/src/amd64.amd64/tmp -B/usr/local/x86_64-unknown-freebsd14.3/bin/ -O2 -pipe -fno-common -I/workspace/src/sys -fPIE -ffile-prefix-map=/workspace/src=/usr/src -ffile-prefix-map=/tmp/obj/workspace/src=/usr/obj -g -std=gnu17 -Wno-format-zero-length -fstack-protector-strong -Wsystem-headers -Werror -Wall -Wno-format-y2k -W -Wno-unused-parameter -Wmissing-prototypes -Wpointer-arith -Wreturn-type -Wcast-qual -Wwrite-strings -Wswitch -Wshadow -Wunused-parameter -Wcast-align -Wchar-subscripts -Wnested-externs -Wold-style-definition -Wno-pointer-sign -Wdate-time -Wno-error=address -Wno-error=array-bounds -Wno-error=attributes -Wno-error=bool-compare -Wno-error=cast-align -Wno-error=clobbered -Wno-error=deprecated-declarations -Wno-error=enum-compare -Wno-error=extra -Wno-error=logical-not-parentheses -Wno-error=strict-aliasing -Wno-error=uninitialized -Wno-error=unused-function -Wno-error=unused-value -Wno-error=empty-body -Wno-error=maybe-uninitialized -Wno-error=nonnull-compare -Wno-error=shift-negative-value -Wno-error=tautological-compare -Wno-error=unused-const-variable -Wno-error=bool-operation -Wno-error=deprecated -Wno-error=expansion-to-defined -Wno-error=format-overflow -Wno-error=format-truncation -Wno-error=implicit-fallthrough -Wno-error=int-in-bool-context -Wno-error=memset-elt-size -Wno-error=noexcept-type -Wno-error=nonnull -Wno-error=pointer-compare -Wno-error=stringop-overflow -Wno-error=aggressive-loop-optimizations -Wno-error=cast-function-type -Wno-error=catch-value -Wno-error=multistatement-macros -Wno-error=restrict -Wno-error=sizeof-pointer-memaccess -Wno-error=stringop-truncation -Wno-return-type  -Wl,-zrelro -pie -Wl,-znoexecstack  -o prout_register_huge_cdb.full prout_register_huge_cdb.pieo   -lcam
--- all_subdir_tests/sys/capsicum ---
--- .depend.mini-me ---
echo mini-me.full: /tmp/obj/workspace/src/amd64.amd64/tmp/usr/lib/libc.a  >> .depend.mini-me
--- mini-me.o ---
/usr/local/bin/x86_64-unknown-freebsd14.3-gcc12 --sysroot=/tmp/obj/workspace/src/amd64.amd64/tmp -B/usr/local/x86_64-unknown-freebsd14.3/bin/  -O2 -pipe -fno-common   -I/workspace/src/tests -ffile-prefix-map=/workspace/src=/usr/src -ffile-prefix-map=/tmp/obj/workspace/src=/usr/obj -g -MD  -MF.depend.mini-me.mini-me.o -MTmini-me.o -std=gnu17 -Wno-format-zero-length -fstack-protector-strong -Wsystem-headers -Werror -Wall -Wno-format-y2k -W -Wno-unused-parameter -Wmissing-prototypes -Wpointer-arith -Wreturn-type -Wcast-qual -Wwrite-strings -Wswitch -Wshadow -Wunused-parameter -Wcast-align -Wchar-subscripts -Wnested-externs -Wold-style-definition -Wno-pointer-sign -Wdate-time -Wno-error=address -Wno-error=array-bounds -Wno-error=attributes -Wno-error=bool-compare -Wno-error=cast-align -Wno-error=clobbered -Wno-error=deprecated-declarations -Wno-error=enum-compare -Wno-error=extra -Wno-error=logical-not-parentheses -Wno-error=strict-aliasing -Wno-error=uninitialized -Wno-error=unused-function -Wno-error=unused-value -Wno-error=empty-body -Wno-error=maybe-uninitialized -Wno-error=nonnull-compare -Wno-error=shift-negative-value -Wno-error=tautological-compare -Wno-error=unused-const-variable -Wno-error=bool-operation -Wno-error=deprecated -Wno-error=expansion-to-defined -Wno-error=format-overflow -Wno-error=format-truncation -Wno-error=implicit-fallthrough -Wno-error=int-in-bool-context -Wno-error=memset-elt-size -Wno-error=noexcept-type -Wno-error=nonnull -Wno-error=pointer-compare -Wno-error=stringop-overflow -Wno-error=aggressive-loop-optimizations -Wno-error=cast-function-type -Wno-error=catch-value -Wno-error=multistatement-macros -Wno-error=restrict -Wno-error=sizeof-pointer-memaccess -Wno-error=stringop-truncation -Wno-return-type      -c /workspace/src/contrib/capsicum-test/mini-me.c -o mini-me.o
--- mini-me.noexec ---
(cd /workspace/src/tests/sys/capsicum &&  DEPENDFILE=.depend.mini-me.noexec  NO_SUBDIR=1 make -f /workspace/src/tests/sys/capsicum/Makefile _RECURSING_PROGS=t  PROG=mini-me.noexec )
--- all_subdir_tests/sys/cam ---
--- prout_register_huge_cdb.debug ---
/usr/local/x86_64-unknown-freebsd14.3/bin/objcopy --only-keep-debug prout_register_huge_cdb.full prout_register_huge_cdb.debug
--- prout_register_huge_cdb ---
/usr/local/x86_64-unknown-freebsd14.3/bin/objcopy --strip-debug --add-gnu-debuglink=prout_register_huge_cdb.debug  prout_register_huge_cdb.full prout_register_huge_cdb
--- persist ---
echo '#! /usr/libexec/atf-sh' > persist.tmp
cat /workspace/src/tests/sys/cam/ctl/persist.sh >>persist.tmp
--- all_subdir_tests/sys/capsicum ---
--- .depend.mini-me.noexec ---
echo mini-me.noexec.full: /tmp/obj/workspace/src/amd64.amd64/tmp/usr/lib/libc.a  >> .depend.mini-me.noexec
--- mini-me.noexec.full ---
/usr/local/bin/x86_64-unknown-freebsd14.3-gcc12 --sysroot=/tmp/obj/workspace/src/amd64.amd64/tmp -B/usr/local/x86_64-unknown-freebsd14.3/bin/ -O2 -pipe -fno-common -I/workspace/src/tests -ffile-prefix-map=/workspace/src=/usr/src -ffile-prefix-map=/tmp/obj/workspace/src=/usr/obj -g -std=gnu17 -Wno-format-zero-length -fstack-protector-strong -Wsystem-headers -Werror -Wall -Wno-format-y2k -W -Wno-unused-parameter -Wmissing-prototypes -Wpointer-arith -Wreturn-type -Wcast-qual -Wwrite-strings -Wswitch -Wshadow -Wunused-parameter -Wcast-align -Wchar-subscripts -Wnested-externs -Wold-style-definition -Wno-pointer-sign -Wdate-time -Wno-error=address -Wno-error=array-bounds -Wno-error=attributes -Wno-error=bool-compare -Wno-error=cast-align -Wno-error=clobbered -Wno-error=deprecated-declarations -Wno-error=enum-compare -Wno-error=extra -Wno-error=logical-not-parentheses -Wno-error=strict-aliasing -Wno-error=uninitialized -Wno-error=unused-function -Wno-error=unused-value -Wno-error=empty-body -Wno-error=maybe-uninitialized -Wno-error=nonnull-compare -Wno-error=shift-negative-value -Wno-error=tautological-compare -Wno-error=unused-const-variable -Wno-error=bool-operation -Wno-error=deprecated -Wno-error=expansion-to-defined -Wno-error=format-overflow -Wno-error=format-truncation -Wno-error=implicit-fallthrough -Wno-error=int-in-bool-context -Wno-error=memset-elt-size -Wno-error=noexcept-type -Wno-error=nonnull -Wno-error=pointer-compare -Wno-error=stringop-overflow -Wno-error=aggressive-loop-optimizations -Wno-error=cast-function-type -Wno-error=catch-value -Wno-error=multistatement-macros -Wno-error=restrict -Wno-error=sizeof-pointer-memaccess -Wno-error=stringop-truncation -Wno-return-type  -Wl,-zrelro -static -Wl,-znoexecstack  -o mini-me.noexec.full mini-me.o  
--- all_subdir_tests/sys/cam ---
chmod +x persist.tmp
mv persist.tmp persist
--- prevent ---
echo '#! /usr/libexec/atf-sh' > prevent.tmp
cat /workspace/src/tests/sys/cam/ctl/prevent.sh >>prevent.tmp
chmod +x prevent.tmp
mv prevent.tmp prevent
--- read_buffer ---
echo '#! /usr/libexec/atf-sh' > read_buffer.tmp
cat /workspace/src/tests/sys/cam/ctl/read_buffer.sh >>read_buffer.tmp
chmod +x read_buffer.tmp
mv read_buffer.tmp read_buffer
--- start_stop_unit ---
echo '#! /usr/libexec/atf-sh' > start_stop_unit.tmp
cat /workspace/src/tests/sys/cam/ctl/start_stop_unit.sh >>start_stop_unit.tmp
chmod +x start_stop_unit.tmp
mv start_stop_unit.tmp start_stop_unit
--- Kyuafile ---
--- all_subdir_lib ---
--- getbsize.3.gz ---
gzip -cn /workspace/src/lib/libc/gen/getbsize.3 > getbsize.3.gz
--- all_subdir_tests ---
--- all_subdir_tests/sys/capsicum ---
--- mini-me ---
--- mini-me.full ---
/usr/local/bin/x86_64-unknown-freebsd14.3-gcc12 --sysroot=/tmp/obj/workspace/src/amd64.amd64/tmp -B/usr/local/x86_64-unknown-freebsd14.3/bin/ -O2 -pipe -fno-common -I/workspace/src/tests -ffile-prefix-map=/workspace/src=/usr/src -ffile-prefix-map=/tmp/obj/workspace/src=/usr/obj -g -std=gnu17 -Wno-format-zero-length -fstack-protector-strong -Wsystem-headers -Werror -Wall -Wno-format-y2k -W -Wno-unused-parameter -Wmissing-prototypes -Wpointer-arith -Wreturn-type -Wcast-qual -Wwrite-strings -Wswitch -Wshadow -Wunused-parameter -Wcast-align -Wchar-subscripts -Wnested-externs -Wold-style-definition -Wno-pointer-sign -Wdate-time -Wno-error=address -Wno-error=array-bounds -Wno-error=attributes -Wno-error=bool-compare -Wno-error=cast-align -Wno-error=clobbered -Wno-error=deprecated-declarations -Wno-error=enum-compare -Wno-error=extra -Wno-error=logical-not-parentheses -Wno-error=strict-aliasing -Wno-error=uninitialized -Wno-error=unused-function -Wno-error=unused-value -Wno-error=empty-body -Wno-error=maybe-uninitialized -Wno-error=nonnull-compare -Wno-error=shift-negative-value -Wno-error=tautological-compare -Wno-error=unused-const-variable -Wno-error=bool-operation -Wno-error=deprecated -Wno-error=expansion-to-defined -Wno-error=format-overflow -Wno-error=format-truncation -Wno-error=implicit-fallthrough -Wno-error=int-in-bool-context -Wno-error=memset-elt-size -Wno-error=noexcept-type -Wno-error=nonnull -Wno-error=pointer-compare -Wno-error=stringop-overflow -Wno-error=aggressive-loop-optimizations -Wno-error=cast-function-type -Wno-error=catch-value -Wno-error=multistatement-macros -Wno-error=restrict -Wno-error=sizeof-pointer-memaccess -Wno-error=stringop-truncation -Wno-return-type  -Wl,-zrelro -static -Wl,-znoexecstack  -o mini-me.full mini-me.o  
--- all_subdir_rescue ---
--- cvt.o ---
/usr/local/bin/x86_64-unknown-freebsd14.3-gcc12 --sysroot=/tmp/obj/workspace/src/amd64.amd64/tmp -B/usr/local/x86_64-unknown-freebsd14.3/bin/  -O2 -pipe -fno-common -I/workspace/src/usr.bin/less -I/workspace/src/contrib/less   -DRESCUE -I/tmp/obj/workspace/src/amd64.amd64/lib/libifconfig -I/tmp/obj/workspace/src/amd64.amd64/lib/libiscsiutil -ffile-prefix-map=/workspace/src=/usr/src -ffile-prefix-map=/tmp/obj/workspace/src/amd64.amd64/rescue/rescue/workspace/src=/usr/obj -g -MD  -MF.depend.cvt.o -MTcvt.o -std=gnu17 -Wno-format-zero-length -fstack-protector-strong -Wsystem-headers -Werror -Wno-pointer-sign -Wdate-time -Wno-error=address -Wno-error=array-bounds -Wno-error=attributes -Wno-error=bool-compare -Wno-error=cast-align -Wno-error=clobbered -Wno-error=deprecated-declarations -Wno-error=enum-compare -Wno-error=extra -Wno-error=logical-not-parentheses -Wno-error=strict-aliasing -Wno-error=uninitialized -Wno-error=unused-function -Wno-error=unused-value -Wno-error=empty-body -Wno-error=maybe-uninitialized -Wno-error=nonnull-compare -Wno-error=shift-negative-value -Wno-error=tautological-compare -Wno-error=unused-const-variable -Wno-error=bool-operation -Wno-error=deprecated -Wno-error=expansion-to-defined -Wno-error=format-overflow -Wno-error=format-truncation -Wno-error=implicit-fallthrough -Wno-error=int-in-bool-context -Wno-error=memset-elt-size -Wno-error=noexcept-type -Wno-error=nonnull -Wno-error=pointer-compare -Wno-error=stringop-overflow -Wno-error=aggressive-loop-optimizations -Wno-error=cast-function-type -Wno-error=catch-value -Wno-error=multistatement-macros -Wno-error=restrict -Wno-error=sizeof-pointer-memaccess -Wno-error=stringop-truncation -Wno-return-type -Wno-address-of-packed-member       -c /workspace/src/contrib/less/cvt.c -o cvt.o
--- all_subdir_usr.sbin ---
In file included from /tmp/obj/workspace/src/amd64.amd64/tmp/usr/include/c++/v1/type_traits:490,
                 from /tmp/obj/workspace/src/amd64.amd64/tmp/usr/include/c++/v1/new:359,
                 from /tmp/obj/workspace/src/amd64.amd64/tmp/usr/include/c++/v1/__memory/construct_at.h:23,
                 from /tmp/obj/workspace/src/amd64.amd64/tmp/usr/include/c++/v1/__string/constexpr_c_functions.h:14,
                 from /tmp/obj/workspace/src/amd64.amd64/tmp/usr/include/c++/v1/__algorithm/equal.h:20,
                 from /tmp/obj/workspace/src/amd64.amd64/tmp/usr/include/c++/v1/array:114,
                 from /workspace/src/usr.sbin/ctld/ctld.hh:44,
                 from /workspace/src/usr.sbin/ctld/kernel.cc:70:
/tmp/obj/workspace/src/amd64.amd64/tmp/usr/include/c++/v1/__type_traits/result_of.h:28:28: warning: 'template<class _Callable> class std::__1::result_of' is deprecated [-Wdeprecated-declarations]
   28 | class _LIBCPP_TEMPLATE_VIS result_of<_Fp(_Args...)> : public __invoke_of<_Fp, _Args...> {};
      |                            ^~~~~~~~~
/tmp/obj/workspace/src/amd64.amd64/tmp/usr/include/c++/v1/__type_traits/result_of.h:25:35: note: declared here
   25 | class _LIBCPP_DEPRECATED_IN_CXX17 result_of;
      |                                   ^~~~~~~~~
/tmp/obj/workspace/src/amd64.amd64/tmp/usr/include/c++/v1/__type_traits/result_of.h:32:58: warning: 'template<class _Callable> class std::__1::result_of' is deprecated [-Wdeprecated-declarations]
   32 | using result_of_t _LIBCPP_DEPRECATED_IN_CXX17 = typename result_of<_Tp>::type;
      |                                                          ^~~~~~~~~
/tmp/obj/workspace/src/amd64.amd64/tmp/usr/include/c++/v1/__type_traits/result_of.h:25:35: note: declared here
   25 | class _LIBCPP_DEPRECATED_IN_CXX17 result_of;
      |                                   ^~~~~~~~~
--- all_subdir_lib ---
--- getcap.3.gz ---
gzip -cn /workspace/src/lib/libc/gen/getcap.3 > getcap.3.gz
--- all_subdir_rescue ---
--- xz_make ---
--- file_io.o ---
/usr/local/bin/x86_64-unknown-freebsd14.3-gcc12 --sysroot=/tmp/obj/workspace/src/amd64.amd64/tmp -B/usr/local/x86_64-unknown-freebsd14.3/bin/  -O2 -pipe -fno-common   -DHAVE_CONFIG_H  -I/workspace/src/lib/liblzma  -I/workspace/src/contrib/xz/src/common -DRESCUE -I/tmp/obj/workspace/src/amd64.amd64/lib/libifconfig -I/tmp/obj/workspace/src/amd64.amd64/lib/libiscsiutil -ffile-prefix-map=/workspace/src=/usr/src -ffile-prefix-map=/tmp/obj/workspace/src/amd64.amd64/rescue/rescue/workspace/src=/usr/obj -g -MD  -MF.depend.file_io.o -MTfile_io.o -std=gnu17 -Wno-format-zero-length -fstack-protector-strong -Wsystem-headers -Werror -Wall -Wno-format-y2k -W -Wno-unused-parameter -Wmissing-prototypes -Wpointer-arith -Wno-uninitialized -Wno-pointer-sign -Wdate-time -Wno-error=address -Wno-error=array-bounds -Wno-error=attributes -Wno-error=bool-compare -Wno-error=cast-align -Wno-error=clobbered -Wno-error=deprecated-declarations -Wno-error=enum-compare -Wno-error=extra -Wno-error=logical-not-parentheses -Wno-error=strict-aliasing -Wno-error=uninitialized -Wno-error=unused-function -Wno-error=unused-value -Wno-error=empty-body -Wno-error=maybe-uninitialized -Wno-error=nonnull-compare -Wno-error=shift-negative-value -Wno-error=tautological-compare -Wno-error=unused-const-variable -Wno-error=bool-operation -Wno-error=deprecated -Wno-error=expansion-to-defined -Wno-error=format-overflow -Wno-error=format-truncation -Wno-error=implicit-fallthrough -Wno-error=int-in-bool-context -Wno-error=memset-elt-size -Wno-error=noexcept-type -Wno-error=nonnull -Wno-error=pointer-compare -Wno-error=stringop-overflow -Wno-error=aggressive-loop-optimizations -Wno-error=cast-function-type -Wno-error=catch-value -Wno-error=multistatement-macros -Wno-error=restrict -Wno-error=sizeof-pointer-memaccess -Wno-error=stringop-truncation -Wno-return-type -Wno-address-of-packed-member       -c /workspace/src/contrib/xz/src/xz/file_io.c -o file_io.o
--- all_subdir_tests ---
--- mini-me.noexec ---
/usr/local/bin/x86_64-unknown-freebsd14.3-ld: /tmp/obj/workspace/src/amd64.amd64/tmp/usr/lib/crt1.o: in function `_start':
/workspace/src/lib/csu/amd64/crt1_s.S:66:(.text+0x17): undefined reference to `main'
--- all_subdir_lib ---
--- all_subdir_lib/libc/tests ---
--- all_subdir_lib/libc/tests/net/getaddrinfo ---
===> lib/libc/tests/net/getaddrinfo (all)
--- h_gai ---
(cd /workspace/src/lib/libc/tests/net/getaddrinfo &&  DEPENDFILE=.depend.h_gai  NO_SUBDIR=1 make -f /workspace/src/lib/libc/tests/net/getaddrinfo/Makefile _RECURSING_PROGS=t  PROG=h_gai )
--- all_subdir_tests ---
--- mini-me ---
--- mini-me.debug ---
/usr/local/x86_64-unknown-freebsd14.3/bin/objcopy --only-keep-debug mini-me.full mini-me.debug
--- mini-me ---
/usr/local/x86_64-unknown-freebsd14.3/bin/objcopy --strip-debug --add-gnu-debuglink=mini-me.debug  mini-me.full mini-me
--- all_subdir_lib ---
--- .depend.h_gai ---
echo h_gai.full: /tmp/obj/workspace/src/amd64.amd64/tmp/usr/lib/libc.a  >> .depend.h_gai
--- h_gai.pieo ---
/usr/local/bin/x86_64-unknown-freebsd14.3-gcc12 --sysroot=/tmp/obj/workspace/src/amd64.amd64/tmp -B/usr/local/x86_64-unknown-freebsd14.3/bin/ -fpie -DPIC   -O2 -pipe -fno-common   -fPIE -ffile-prefix-map=/workspace/src=/usr/src -ffile-prefix-map=/tmp/obj/workspace/src=/usr/obj -g -MD  -MF.depend.h_gai.h_gai.pieo -MTh_gai.pieo -std=gnu17 -Wno-format-zero-length -fstack-protector-strong -Wsystem-headers -Werror -Wall -Wno-format-y2k -Wno-uninitialized -Wno-pointer-sign -Wdate-time -Wno-error=address -Wno-error=array-bounds -Wno-error=attributes -Wno-error=bool-compare -Wno-error=cast-align -Wno-error=clobbered -Wno-error=deprecated-declarations -Wno-error=enum-compare -Wno-error=extra -Wno-error=logical-not-parentheses -Wno-error=strict-aliasing -Wno-error=uninitialized -Wno-error=unused-function -Wno-error=unused-value -Wno-error=empty-body -Wno-error=maybe-uninitialized -Wno-error=nonnull-compare -Wno-error=shift-negative-value -Wno-error=tautological-compare -Wno-error=unused-const-variable -Wno-error=bool-operation -Wno-error=deprecated -Wno-error=expansion-to-defined -Wno-error=format-overflow -Wno-error=format-truncation -Wno-error=implicit-fallthrough -Wno-error=int-in-bool-context -Wno-error=memset-elt-size -Wno-error=noexcept-type -Wno-error=nonnull -Wno-error=pointer-compare -Wno-error=stringop-overflow -Wno-error=aggressive-loop-optimizations -Wno-error=cast-function-type -Wno-error=catch-value -Wno-error=multistatement-macros -Wno-error=restrict -Wno-error=sizeof-pointer-memaccess -Wno-error=stringop-truncation -Wno-return-type -Wno-address-of-packed-member      -c /workspace/src/contrib/netbsd-tests/lib/libc/net/getaddrinfo/h_gai.c -o h_gai.pieo
--- all_subdir_tests ---
--- mini-me.noexec ---
collect2: error: ld returned 1 exit status

make[2]: stopped in /workspace/src
--- all_subdir_usr.bin ---

make[2]: stopped in /workspace/src
--- all_subdir_rescue ---
*** [objs] Error code 6

make[4]: stopped in /workspace/src/rescue/rescue
1 error

make[4]: stopped in /workspace/src/rescue/rescue
--- all_subdir_usr.sbin ---

make[2]: stopped in /workspace/src
--- all_subdir_rescue ---

make[3]: stopped in /workspace/src/rescue

make[2]: stopped in /workspace/src
--- all_subdir_lib ---

make[3]: stopped in /workspace/src/lib

make[2]: stopped in /workspace/src
--- all_subdir_cddl ---

make[6]: stopped in /workspace/src/cddl/usr.sbin/zfsd/tests

make[5]: stopped in /workspace/src/cddl/usr.sbin/zfsd

make[4]: stopped in /workspace/src/cddl/usr.sbin

make[3]: stopped in /workspace/src/cddl

make[2]: stopped in /workspace/src
      149.19 real      1110.89 user       106.70 sys

make[1]: stopped in /workspace/src

make: stopped in /workspace/src
Build step 'Execute shell' marked build as failure
[WARNINGS]Skipping publisher since build result is FAILURE
[PostBuildScript] - [INFO] Executing post build scripts.
[FreeBSD-stable-15-amd64-gcc12_build] $ /bin/sh -xe /tmp/jenkins13119409622174637803.sh
+ sh freebsd-ci/scripts/jail/clean.sh
clean jail FreeBSD-stable-15-amd64-gcc12_build
Checking for post-build
Performing post-build step
Checking if email needs to be generated
Email was triggered for: Failure - Any
Sending email for trigger: Failure - Any
Sending mail from default account using System Admin e-mail address