FreeBSD-stable-15-amd64-test - Build #270 - Still Unstable
Date: Fri, 28 Nov 2025 01:47:53 UTC
FreeBSD-stable-15-amd64-test - Build #270 (0c87d29a54da527b2f624cf4d2999ebeb9885f15) - Still Unstable
Build information: https://ci.FreeBSD.org/job/FreeBSD-stable-15-amd64-test/270/
Full change log: https://ci.FreeBSD.org/job/FreeBSD-stable-15-amd64-test/270/changes
Full build log: https://ci.FreeBSD.org/job/FreeBSD-stable-15-amd64-test/270/console
Status explanation:
"Unstable" - some tests are suspected being broken by the following changes
"Still Unstable" - the failing test cases have not been fixed by these
following changes and this is a notification to note that
these changes have not been fully tested by the CI system
Change summaries:
(Those commits are likely but not certainly responsible)
0c87d29a54da527b2f624cf4d2999ebeb9885f15 by cperciva:
pkg: Move FreeBSD-base to pkg.freebsd.org
The failed test cases:
3 tests failed.
FAILED: sys.net.if_gif.6in6
Error Message:
atf-check failed; see the output of the test for details
FAILED: sys.netpfil.pf.route_to.prefer_ipv6_nexthop_mixed_af_random_table_ipv4
Error Message:
Target 2001:db8:4202::42:4 not selected after 10 attempts!
FAILED: sys.netlink.test_netlink_message_writer.py.__test_cases_list__
Error Message:
Test program did not exit cleanly