FreeBSD-main-amd64-gcc13_build - Build #5113 - Failure

From: <jenkins-admin_at_FreeBSD.org>
Date: Wed, 26 Nov 2025 19:16:20 UTC
FreeBSD-main-amd64-gcc13_build - Build #5113 (821774dfbdaa12ef072ff7eaea8f9966a7e63935) - Failure

Build information: https://ci.FreeBSD.org/job/FreeBSD-main-amd64-gcc13_build/5113/
Full change log: https://ci.FreeBSD.org/job/FreeBSD-main-amd64-gcc13_build/5113/changes
Full build log: https://ci.FreeBSD.org/job/FreeBSD-main-amd64-gcc13_build/5113/console

Status explanation:
"Failure" - the build is suspected being broken by the following changes
"Still Failing" - the build has not been fixed by the following changes and
                  this is a notification to note that these changes have
                  not been fully tested by the CI system

Change summaries:
(Those commits are likely but not certainly responsible)

525c535d5aa87f686dcfee620619827f7c6090db by cy:
ipfilter: Add ipf_check_names_string()

eda1756d0454f9383940dc825cf571ff67e0c013 by cy:
ipfilter: Verify frentry on entry into kernel

821774dfbdaa12ef072ff7eaea8f9966a7e63935 by cy:
ipfilter: Verify ipnat on entry into kernel



The end of the build log:

[...truncated 96.35 MiB...]
--- all_subdir_lib/libc/tests/tls ---
/usr/local/x86_64-unknown-freebsd14.3/bin/ar -crsD libh_tls_dlopen.a h_tls_dlopen.o  
--- all_subdir_lib/libc/tests/sys ---
/usr/local/bin/x86_64-unknown-freebsd14.3-gcc13 --sysroot=/tmp/obj/workspace/src/amd64.amd64/tmp -B/usr/local/x86_64-unknown-freebsd14.3/bin/ -O2 -pipe -fno-common -I/workspace/src/lib/libnetbsd -I/workspace/src/contrib/netbsd-tests -fPIE -g -std=gnu17 -Wno-format-zero-length -fstack-protector-strong -Wsystem-headers -Werror -Wall -Wno-format-y2k -Wno-uninitialized -Wno-pointer-sign -Wdate-time -Wno-error=address -Wno-error=array-bounds -Wno-error=attributes -Wno-error=bool-compare -Wno-error=cast-align -Wno-error=clobbered -Wno-error=deprecated-declarations -Wno-error=enum-compare -Wno-error=extra -Wno-error=logical-not-parentheses -Wno-error=strict-aliasing -Wno-error=uninitialized -Wno-error=unused-function -Wno-error=unused-value -Wno-error=empty-body -Wno-error=maybe-uninitialized -Wno-error=nonnull-compare -Wno-error=shift-negative-value -Wno-error=tautological-compare -Wno-error=unused-const-variable -Wno-error=bool-operation -Wno-error=deprecated -Wno-error=expansion-to-defined -Wno-error=format-overflow -Wno-error=format-truncation -Wno-error=implicit-fallthrough -Wno-error=int-in-bool-context -Wno-error=memset-elt-size -Wno-error=noexcept-type -Wno-error=nonnull -Wno-error=pointer-compare -Wno-error=stringop-overflow -Wno-error=aggressive-loop-optimizations -Wno-error=cast-function-type -Wno-error=catch-value -Wno-error=multistatement-macros -Wno-error=restrict -Wno-error=sizeof-pointer-memaccess -Wno-error=stringop-truncation -Wno-return-type -Wno-address-of-packed-member  -L/tmp/obj/workspace/src/amd64.amd64/lib/libnetbsd -Wl,-zrelro -pie -Wl,-znoexecstack  -o socketpair_test.full t_socketpair.pieo  -lprivateatf-c -L/tmp/obj/workspace/src/amd64.amd64/lib/libnetbsd -lnetbsd_pie
--- all_subdir_lib/libc/tests/tls ---
--- h_tls_dlopen.so.full ---
--- all_subdir_rescue ---
--- mt_make ---
--- .depend ---
--- all_subdir_lib ---
Building shared library h_tls_dlopen.so
--- all_subdir_rescue ---
echo mt.full: /tmp/obj/workspace/src/amd64.amd64/tmp/usr/lib/libc.a /tmp/obj/workspace/src/amd64.amd64/tmp/usr/lib/libmt.a /tmp/obj/workspace/src/amd64.amd64/tmp/usr/lib/libsbuf.a /tmp/obj/workspace/src/amd64.amd64/tmp/usr/lib/libbsdxml.a >> .depend
--- all_subdir_lib ---
/usr/local/bin/x86_64-unknown-freebsd14.3-gcc13 --sysroot=/tmp/obj/workspace/src/amd64.amd64/tmp -B/usr/local/x86_64-unknown-freebsd14.3/bin/  -Wl,-zrelro -Wl,-znoexecstack   -fstack-protector-strong -shared -Wl,-x -Wl,--fatal-warnings -Wl,--warn-shared-textrel  -o h_tls_dlopen.so.full -Wl,-soname,h_tls_dlopen.so h_tls_dlopen.pico 
--- all_subdir_rescue ---
--- mt.o ---
/usr/local/bin/x86_64-unknown-freebsd14.3-gcc13 --sysroot=/tmp/obj/workspace/src/amd64.amd64/tmp -B/usr/local/x86_64-unknown-freebsd14.3/bin/  -O2 -pipe -fno-common   -DRESCUE -I/tmp/obj/workspace/src/amd64.amd64/lib/libifconfig -I/tmp/obj/workspace/src/amd64.amd64/lib/libiscsiutil -g -MD  -MF.depend.mt.o -MTmt.o -std=gnu17 -Wno-format-zero-length -fstack-protector-strong -Wsystem-headers -Werror -Wall -Wno-format-y2k -W -Wno-unused-parameter -Wmissing-prototypes -Wpointer-arith -Wreturn-type -Wcast-qual -Wwrite-strings -Wswitch -Wshadow -Wunused-parameter -Wcast-align -Wchar-subscripts -Wnested-externs -Wold-style-definition -Wno-pointer-sign -Wdate-time -Wno-error=address -Wno-error=array-bounds -Wno-error=attributes -Wno-error=bool-compare -Wno-error=cast-align -Wno-error=clobbered -Wno-error=deprecated-declarations -Wno-error=enum-compare -Wno-error=extra -Wno-error=logical-not-parentheses -Wno-error=strict-aliasing -Wno-error=uninitialized -Wno-error=unused-function -Wno-error=unused-value -Wno-error=empty-body -Wno-error=maybe-uninitialized -Wno-error=nonnull-compare -Wno-error=shift-negative-value -Wno-error=tautological-compare -Wno-error=unused-const-variable -Wno-error=bool-operation -Wno-error=deprecated -Wno-error=expansion-to-defined -Wno-error=format-overflow -Wno-error=format-truncation -Wno-error=implicit-fallthrough -Wno-error=int-in-bool-context -Wno-error=memset-elt-size -Wno-error=noexcept-type -Wno-error=nonnull -Wno-error=pointer-compare -Wno-error=stringop-overflow -Wno-error=aggressive-loop-optimizations -Wno-error=cast-function-type -Wno-error=catch-value -Wno-error=multistatement-macros -Wno-error=restrict -Wno-error=sizeof-pointer-memaccess -Wno-error=stringop-truncation -Wno-return-type        -c /workspace/src/usr.bin/mt/mt.c -o mt.o
--- all_subdir_lib ---
--- h_tls_dlopen.so.debug ---
--- all_subdir_lib/libc/tests/sys ---
--- socketpair_test.debug ---
--- all_subdir_lib/libc/tests/tls ---
/usr/local/x86_64-unknown-freebsd14.3/bin/objcopy --only-keep-debug h_tls_dlopen.so.full h_tls_dlopen.so.debug
--- all_subdir_lib/libc/tests/sys ---
/usr/local/x86_64-unknown-freebsd14.3/bin/objcopy --only-keep-debug socketpair_test.full socketpair_test.debug
--- all_subdir_lib/libc/tests/tls ---
--- h_tls_dlopen.so ---
--- all_subdir_lib/libc/tests/sys ---
--- socketpair_test ---
--- all_subdir_lib/libc/tests/tls ---
/usr/local/x86_64-unknown-freebsd14.3/bin/objcopy --strip-debug --add-gnu-debuglink=h_tls_dlopen.so.debug  h_tls_dlopen.so.full h_tls_dlopen.so
--- all_subdir_lib/libc/tests/sys ---
/usr/local/x86_64-unknown-freebsd14.3/bin/objcopy --strip-debug --add-gnu-debuglink=socketpair_test.debug  socketpair_test.full socketpair_test
--- all_subdir_rescue ---
--- zpool_make ---
--- zpool_vdev_os.o ---
--- all_subdir_lib ---
--- stat_test ---
--- all_subdir_rescue ---
/usr/local/bin/x86_64-unknown-freebsd14.3-gcc13 --sysroot=/tmp/obj/workspace/src/amd64.amd64/tmp -B/usr/local/x86_64-unknown-freebsd14.3/bin/  -O2 -pipe -fno-common -DIN_BASE  -I/workspace/src/sys/contrib/openzfs/include  -I/workspace/src/sys/contrib/openzfs/lib/libspl/include  -I/workspace/src/sys/contrib/openzfs/lib/libspl/include/os/freebsd  -I/workspace/src/sys/contrib/openzfs/lib/libzpool/include  -I/workspace/src/sys  -I/workspace/src/cddl/compat/opensolaris/include  -I/workspace/src/sys/contrib/openzfs/cmd/zpool  -include /workspace/src/sys/contrib/openzfs/include/os/freebsd/spl/sys/ccompile.h  -DHAVE_ISSETUGID  -include /workspace/src/sys/modules/zfs/zfs_config.h  -DSYSCONFDIR=\"/etc\"  -DPKGDATADIR=\"/usr/share/zfs\"   -DNEED_SOLARIS_BOOLEAN -DHAVE_STRLCAT -DHAVE_STRLCPY -DRESCUE -I/tmp/obj/workspace/src/amd64.amd64/lib/libifconfig -I/tmp/obj/workspace/src/amd64.amd64/lib/libiscsiutil -g -MD  -MF.depend.zpool_vdev_os.o -MTzpool_vdev_os.o -std=gnu17 -Wno-format-zero-length -fstack-protector-strong -Wsystem-headers -Werror -Wall -Wno-format-y2k -Wno-uninitialized -Wno-pointer-sign -Wdate-time -Wno-error=address -Wno-error=array-bounds -Wno-error=attributes -Wno-error=bool-compare -Wno-error=cast-align -Wno-error=clobbered -Wno-error=deprecated-declarations -Wno-error=enum-compare -Wno-error=extra -Wno-error=logical-not-parentheses -Wno-error=strict-aliasing -Wno-error=uninitialized -Wno-error=unused-function -Wno-error=unused-value -Wno-error=empty-body -Wno-error=maybe-uninitialized -Wno-error=nonnull-compare -Wno-error=shift-negative-value -Wno-error=tautological-compare -Wno-error=unused-const-variable -Wno-error=bool-operation -Wno-error=deprecated -Wno-error=expansion-to-defined -Wno-error=format-overflow -Wno-error=format-truncation -Wno-error=implicit-fallthrough -Wno-error=int-in-bool-context -Wno-error=memset-elt-size -Wno-error=noexcept-type -Wno-error=nonnull -Wno-error=pointer-compare -Wno-error=stringop-overflow -Wno-error=aggressive-loop-optimizations -Wno-error=cast-function-type -Wno-error=catch-value -Wno-error=multistatement-macros -Wno-error=restrict -Wno-error=sizeof-pointer-memaccess -Wno-error=stringop-truncation -Wno-return-type -Wno-unknown-pragmas -Wno-address-of-packed-member       -c /workspace/src/sys/contrib/openzfs/cmd/zpool/os/freebsd/zpool_vdev_os.c -o zpool_vdev_os.o
--- all_subdir_lib ---
(cd /workspace/src/lib/libc/tests/sys &&  DEPENDFILE=.depend.stat_test  NO_SUBDIR=1 make -f /workspace/src/lib/libc/tests/sys/Makefile _RECURSING_PROGS=t  PROG=stat_test )
--- .depend.stat_test ---
echo stat_test.full: /tmp/obj/workspace/src/amd64.amd64/tmp/usr/lib/libc.a /tmp/obj/workspace/src/amd64.amd64/tmp/usr/lib/libprivateatf-c.a /tmp/obj/workspace/src/amd64.amd64/lib/libnetbsd/libnetbsd_pie.a >> .depend.stat_test
--- t_stat.pieo ---
/usr/local/bin/x86_64-unknown-freebsd14.3-gcc13 --sysroot=/tmp/obj/workspace/src/amd64.amd64/tmp -B/usr/local/x86_64-unknown-freebsd14.3/bin/ -fpie -DPIC   -O2 -pipe -fno-common   -I/workspace/src/lib/libnetbsd -I/workspace/src/contrib/netbsd-tests -fPIE -g -MD  -MF.depend.stat_test.t_stat.pieo -MTt_stat.pieo -std=gnu17 -Wno-format-zero-length -fstack-protector-strong -Wsystem-headers -Werror -Wall -Wno-format-y2k -Wno-uninitialized -Wno-pointer-sign -Wdate-time -Wno-error=address -Wno-error=array-bounds -Wno-error=attributes -Wno-error=bool-compare -Wno-error=cast-align -Wno-error=clobbered -Wno-error=deprecated-declarations -Wno-error=enum-compare -Wno-error=extra -Wno-error=logical-not-parentheses -Wno-error=strict-aliasing -Wno-error=uninitialized -Wno-error=unused-function -Wno-error=unused-value -Wno-error=empty-body -Wno-error=maybe-uninitialized -Wno-error=nonnull-compare -Wno-error=shift-negative-value -Wno-error=tautological-compare -Wno-error=unused-const-variable -Wno-error=bool-operation -Wno-error=deprecated -Wno-error=expansion-to-defined -Wno-error=format-overflow -Wno-error=format-truncation -Wno-error=implicit-fallthrough -Wno-error=int-in-bool-context -Wno-error=memset-elt-size -Wno-error=noexcept-type -Wno-error=nonnull -Wno-error=pointer-compare -Wno-error=stringop-overflow -Wno-error=aggressive-loop-optimizations -Wno-error=cast-function-type -Wno-error=catch-value -Wno-error=multistatement-macros -Wno-error=restrict -Wno-error=sizeof-pointer-memaccess -Wno-error=stringop-truncation -Wno-return-type -Wno-address-of-packed-member      -c /workspace/src/contrib/netbsd-tests/lib/libc/sys/t_stat.c -o t_stat.pieo
--- all_subdir_rescue ---
--- dhclient_make ---
--- packet.o ---
/usr/local/bin/x86_64-unknown-freebsd14.3-gcc13 --sysroot=/tmp/obj/workspace/src/amd64.amd64/tmp -B/usr/local/x86_64-unknown-freebsd14.3/bin/  -O2 -pipe -fno-common   -DRESCUE -I/tmp/obj/workspace/src/amd64.amd64/lib/libifconfig -I/tmp/obj/workspace/src/amd64.amd64/lib/libiscsiutil -g -MD  -MF.depend.packet.o -MTpacket.o -std=gnu17 -Wno-format-zero-length -fstack-protector-strong -Wsystem-headers -Werror -Wall -Wno-format-y2k -W -Wno-unused-parameter -Wmissing-prototypes -Wpointer-arith -Wreturn-type -Wcast-qual -Wwrite-strings -Wswitch -Wshadow -Wunused-parameter -Wchar-subscripts -Wnested-externs -Wold-style-definition -Wno-pointer-sign -Wdate-time -Wno-error=address -Wno-error=array-bounds -Wno-error=attributes -Wno-error=bool-compare -Wno-error=cast-align -Wno-error=clobbered -Wno-error=deprecated-declarations -Wno-error=enum-compare -Wno-error=extra -Wno-error=logical-not-parentheses -Wno-error=strict-aliasing -Wno-error=uninitialized -Wno-error=unused-function -Wno-error=unused-value -Wno-error=empty-body -Wno-error=maybe-uninitialized -Wno-error=nonnull-compare -Wno-error=shift-negative-value -Wno-error=tautological-compare -Wno-error=unused-const-variable -Wno-error=bool-operation -Wno-error=deprecated -Wno-error=expansion-to-defined -Wno-error=format-overflow -Wno-error=format-truncation -Wno-error=implicit-fallthrough -Wno-error=int-in-bool-context -Wno-error=memset-elt-size -Wno-error=noexcept-type -Wno-error=nonnull -Wno-error=pointer-compare -Wno-error=stringop-overflow -Wno-error=aggressive-loop-optimizations -Wno-error=cast-function-type -Wno-error=catch-value -Wno-error=multistatement-macros -Wno-error=restrict -Wno-error=sizeof-pointer-memaccess -Wno-error=stringop-truncation -Wno-return-type        -c /workspace/src/sbin/dhclient/packet.c -o packet.o
--- all_subdir_lib ---
--- all_subdir_lib/libc/tests/ttyio ---
===> lib/libc/tests/ttyio (all)
--- ttyio_test ---
(cd /workspace/src/lib/libc/tests/ttyio &&  DEPENDFILE=.depend.ttyio_test  NO_SUBDIR=1 make -f /workspace/src/lib/libc/tests/ttyio/Makefile _RECURSING_PROGS=t  PROG=ttyio_test )
--- all_subdir_usr.sbin ---
--- mpt_show.pieo ---
--- all_subdir_usr.sbin/makefs ---
--- ffs_alloc.pieo ---
/usr/local/bin/x86_64-unknown-freebsd14.3-gcc13 --sysroot=/tmp/obj/workspace/src/amd64.amd64/tmp -B/usr/local/x86_64-unknown-freebsd14.3/bin/ -fpie -DPIC   -O2 -pipe -fno-common   -I/workspace/src/usr.sbin/makefs -I/workspace/src/usr.sbin/makefs/zfs  -I/workspace/src/stand/libsa  -I/workspace/src/sys/cddl/boot -DHAVE_ZFS -I/workspace/src/sys/fs/cd9660/ -DMAKEFS -D_WANT_MSDOSFS_INTERNALS -I/workspace/src/sys/fs/msdosfs -I/workspace/src/sbin/newfs_msdos -DHAVE_STRUCT_STAT_ST_FLAGS=1 -I/workspace/src/contrib/mtree -I/workspace/src/contrib/mknod -I/workspace/src/lib/libnetbsd -fPIE -g -MD  -MF.depend.ffs_alloc.pieo -MTffs_alloc.pieo -std=gnu17 -Wno-format-zero-length -fstack-protector-strong -Wsystem-headers -Werror -Wall -Wno-format-y2k -W -Wno-unused-parameter -Wmissing-prototypes -Wpointer-arith -Wreturn-type -Wcast-qual -Wwrite-strings -Wswitch -Wshadow -Wunused-parameter -Wchar-subscripts -Wnested-externs -Wold-style-definition -Wno-pointer-sign -Wdate-time -Wno-error=address -Wno-error=array-bounds -Wno-err--- all_subdir_usr.sbin/mptutil ---
/usr/local/bin/x86_64-unknown-freebsd14.3-gcc13 --sysroot=/tmp/obj/workspace/src/amd64.amd64/tmp -B/usr/local/x86_64-unknown-freebsd14.3/bin/ -fpie -DPIC   -O2 -pipe -fno-common   -fPIE -g -MD  -MF.depend.mpt_show.pieo -MTmpt_show.pieo -std=gnu17 -Wno-format-zero-length -fstack-protector-strong -Wsystem-headers -Werror -Wall -Wno-format-y2k -W -Wno-unused-parameter -Wmissing-prototypes -Wpointer-arith -Wno-uninitialized -Wno-pointer-sign -Wdate-time -Wno-error=address -Wno-error=array-bounds -Wno-error=attributes -Wno-error=bool-compare -Wno-error=cast-align -Wno-error=clobbered -Wno-error=deprecated-declarations -Wno-error=enum-compare -Wno-error=extra -Wno-error=logical-not-parentheses -Wno-error=strict-aliasing -Wno-error=uninitialized -Wno-error=unused-function -Wno-error=unused-value -Wno-error=empty-body -Wno-error=maybe-uninitialized -Wno-error=nonnull-compare -Wno-error=shift-negative-value -Wno-error=tautological-compare -Wno-error=unused-const-variable -Wno-error=bool-operation -Wno-error=deprecated -Wno-error=expansion-to-defined -Wno-error=format-overflow -Wno-error=format-truncation -Wno-error=implicit-fallthrough -Wno-error=int-in-bool-context -Wno-error=memset-elt-size -Wno-error=noexcept-type -Wno-error=nonnull -Wno-error=pointer-compare -Wno-error=stringop-overflow -Wno-error=aggressive-loop-optimizations -Wno-error=cast-function-type -Wno-error=catch-value -Wno-error=multistatement-macros -Wno-error=restrict -Wno-error=sizeof-pointer-memaccess -Wno-error=stringop-truncation -Wno-return-type -Wno-address-of-packed-member        -c /workspace/src/usr.sbin/mptutil/mpt_show.c -o mpt_show.pieo
--- all_subdir_usr.sbin/makefs ---
or=attributes -Wno-error=bool-compare -Wno-error=cast-align -Wno-error=clobbered -Wno-error=deprecated-declarations -Wno-error=enum-compare -Wno-error=extra -Wno-error=logical-not-parentheses -Wno-error=strict-aliasing -Wno-error=uninitialized -Wno-error=unused-function -Wno-error=unused-value -Wno-error=empty-body -Wno-error=maybe-uninitialized -Wno-error=nonnull-compare -Wno-error=shift-negative-value -Wno-error=tautological-compare -Wno-error=unused-const-variable -Wno-error=bool-operation -Wno-error=deprecated -Wno-error=expansion-to-defined -Wno-error=format-overflow -Wno-error=format-truncation -Wno-error=implicit-fallthrough -Wno-error=int-in-bool-context -Wno-error=memset-elt-size -Wno-error=noexcept-type -Wno-error=nonnull -Wno-error=pointer-compare -Wno-error=stringop-overflow -Wno-error=aggressive-loop-optimizations -Wno-error=cast-function-type -Wno-error=catch-value -Wno-error=multistatement-macros -Wno-error=restrict -Wno-error=sizeof-pointer-memaccess -Wno-error=stringop-truncation -Wno-return-type         -c /workspace/src/usr.sbin/makefs/ffs/ffs_alloc.c -o ffs_alloc.pieo
--- all_subdir_lib ---
--- .depend.ttyio_test ---
echo ttyio_test.full: /tmp/obj/workspace/src/amd64.amd64/tmp/usr/lib/libc.a /tmp/obj/workspace/src/amd64.amd64/tmp/usr/lib/libprivateatf-c.a /tmp/obj/workspace/src/amd64.amd64/tmp/usr/lib/libutil.a /tmp/obj/workspace/src/amd64.amd64/lib/libnetbsd/libnetbsd_pie.a >> .depend.ttyio_test
--- t_ttyio.pieo ---
/usr/local/bin/x86_64-unknown-freebsd14.3-gcc13 --sysroot=/tmp/obj/workspace/src/amd64.amd64/tmp -B/usr/local/x86_64-unknown-freebsd14.3/bin/ -fpie -DPIC   -O2 -pipe -fno-common   -I/workspace/src/lib/libnetbsd -I/workspace/src/contrib/netbsd-tests -fPIE -g -MD  -MF.depend.ttyio_test.t_ttyio.pieo -MTt_ttyio.pieo -std=gnu17 -Wno-format-zero-length -fstack-protector-strong -Wsystem-headers -Werror -Wall -Wno-format-y2k -Wno-uninitialized -Wno-pointer-sign -Wdate-time -Wno-error=address -Wno-error=array-bounds -Wno-error=attributes -Wno-error=bool-compare -Wno-error=cast-align -Wno-error=clobbered -Wno-error=deprecated-declarations -Wno-error=enum-compare -Wno-error=extra -Wno-error=logical-not-parentheses -Wno-error=strict-aliasing -Wno-error=uninitialized -Wno-error=unused-function -Wno-error=unused-value -Wno-error=empty-body -Wno-error=maybe-uninitialized -Wno-error=nonnull-compare -Wno-error=shift-negative-value -Wno-error=tautological-compare -Wno-error=unused-const-variable -Wno-error=bool-operation -Wno-error=deprecated -Wno-error=expansion-to-defined -Wno-error=format-overflow -Wno-error=format-truncation -Wno-error=implicit-fallthrough -Wno-error=int-in-bool-context -Wno-error=memset-elt-size -Wno-error=noexcept-type -Wno-error=nonnull -Wno-error=pointer-compare -Wno-error=stringop-overflow -Wno-error=aggressive-loop-optimizations -Wno-error=cast-function-type -Wno-error=catch-value -Wno-error=multistatement-macros -Wno-error=restrict -Wno-error=sizeof-pointer-memaccess -Wno-error=stringop-truncation -Wno-return-type -Wno-address-of-packed-member      -c /workspace/src/contrib/netbsd-tests/lib/libc/ttyio/t_ttyio.c -o t_ttyio.pieo
--- all_subdir_tests ---
--- all_subdir_tests/sys/capsicum ---
===> tests/sys/capsicum (all)
--- mini-me.pieo ---
/usr/local/bin/x86_64-unknown-freebsd14.3-gcc13 --sysroot=/tmp/obj/workspace/src/amd64.amd64/tmp -B/usr/local/x86_64-unknown-freebsd14.3/bin/ -fpie -DPIC   -O2 -pipe -fno-common   -I/workspace/src/tests -fPIE -g  -std=gnu17 -Wno-format-zero-length -fstack-protector-strong -Wsystem-headers -Werror -Wall -Wno-format-y2k -W -Wno-unused-parameter -Wmissing-prototypes -Wpointer-arith -Wreturn-type -Wcast-qual -Wwrite-strings -Wswitch -Wshadow -Wunused-parameter -Wcast-align -Wchar-subscripts -Wnested-externs -Wold-style-definition -Wno-pointer-sign -Wdate-time -Wno-error=address -Wno-error=array-bounds -Wno-error=attributes -Wno-error=bool-compare -Wno-error=cast-align -Wno-error=clobbered -Wno-error=deprecated-declarations -Wno-error=enum-compare -Wno-error=extra -Wno-error=logical-not-parentheses -Wno-error=strict-aliasing -Wno-error=uninitialized -Wno-error=unused-function -Wno-error=unused-value -Wno-error=empty-body -Wno-error=maybe-uninitialized -Wno-error=nonnull-compare -Wno-error=shift-negative-value -Wno-error=tautological-compare -Wno-error=unused-const-variable -Wno-error=bool-operation -Wno-error=deprecated -Wno-error=expansion-to-defined -Wno-error=format-overflow -Wno-error=format-truncation -Wno-error=implicit-fallthrough -Wno-error=int-in-bool-context -Wno-error=memset-elt-size -Wno-error=noexcept-type -Wno-error=nonnull -Wno-error=pointer-compare -Wno-error=stringop-overflow -Wno-error=aggressive-loop-optimizations -Wno-error=cast-function-type -Wno-error=catch-value -Wno-error=multistatement-macros -Wno-error=restrict -Wno-error=sizeof-pointer-memaccess -Wno-error=stringop-truncation -Wno-return-type         -c /workspace/src/contrib/capsicum-test/mini-me.c -o mini-me.pieo
--- all_subdir_lib ---
--- ttyio_test.full ---
/usr/local/bin/x86_64-unknown-freebsd14.3-gcc13 --sysroot=/tmp/obj/workspace/src/amd64.amd64/tmp -B/usr/local/x86_64-unknown-freebsd14.3/bin/ -O2 -pipe -fno-common -I/workspace/src/lib/libnetbsd -I/workspace/src/contrib/netbsd-tests -fPIE -g -std=gnu17 -Wno-format-zero-length -fstack-protector-strong -Wsystem-headers -Werror -Wall -Wno-format-y2k -Wno-uninitialized -Wno-pointer-sign -Wdate-time -Wno-error=address -Wno-error=array-bounds -Wno-error=attributes -Wno-error=bool-compare -Wno-error=cast-align -Wno-error=clobbered -Wno-error=deprecated-declarations -Wno-error=enum-compare -Wno-error=extra -Wno-error=logical-not-parentheses -Wno-error=strict-aliasing -Wno-error=uninitialized -Wno-error=unused-function -Wno-error=unused-value -Wno-error=empty-body -Wno-error=maybe-uninitialized -Wno-error=nonnull-compare -Wno-error=shift-negative-value -Wno-error=tautological-compare -Wno-error=unused-const-variable -Wno-error=bool-operation -Wno-error=deprecated -Wno-error=expansion-to-defined -Wno-error=format-overflow -Wno-error=format-truncation -Wno-error=implicit-fallthrough -Wno-error=int-in-bool-context -Wno-error=memset-elt-size -Wno-error=noexcept-type -Wno-error=nonnull -Wno-error=pointer-compare -Wno-error=stringop-overflow -Wno-error=aggressive-loop-optimizations -Wno-error=cast-function-type -Wno-error=catch-value -Wno-error=multistatement-macros -Wno-error=restrict -Wno-error=sizeof-pointer-memaccess -Wno-error=stringop-truncation -Wno-return-type -Wno-address-of-packed-member  -L/tmp/obj/workspace/src/amd64.amd64/lib/libnetbsd -Wl,-zrelro -pie -Wl,-znoexecstack  -o ttyio_test.full t_ttyio.pieo  -lprivateatf-c  -lutil -L/tmp/obj/workspace/src/amd64.amd64/lib/libnetbsd -lnetbsd_pie
--- all_subdir_tests ---
--- functional ---
echo '#! /usr/libexec/atf-sh' > functional.tmp
cat /workspace/src/tests/sys/capsicum/functional.sh >>functional.tmp
chmod +x functional.tmp
mv functional.tmp functional
--- Kyuafile ---
--- mini-me ---
(cd /workspace/src/tests/sys/capsicum &&  DEPENDFILE=.depend.mini-me  NO_SUBDIR=1 make -f /workspace/src/tests/sys/capsicum/Makefile _RECURSING_PROGS=t  PROG=mini-me )
--- all_subdir_rescue ---
--- convert.o ---
/usr/local/bin/x86_64-unknown-freebsd14.3-gcc13 --sysroot=/tmp/obj/workspace/src/amd64.amd64/tmp -B/usr/local/x86_64-unknown-freebsd14.3/bin/  -O2 -pipe -fno-common   -DRESCUE -I/tmp/obj/workspace/src/amd64.amd64/lib/libifconfig -I/tmp/obj/workspace/src/amd64.amd64/lib/libiscsiutil -g -MD  -MF.depend.convert.o -MTconvert.o -std=gnu17 -Wno-format-zero-length -fstack-protector-strong -Wsystem-headers -Werror -Wall -Wno-format-y2k -W -Wno-unused-parameter -Wmissing-prototypes -Wpointer-arith -Wreturn-type -Wcast-qual -Wwrite-strings -Wswitch -Wshadow -Wunused-parameter -Wchar-subscripts -Wnested-externs -Wold-style-definition -Wno-pointer-sign -Wdate-time -Wno-error=address -Wno-error=array-bounds -Wno-error=attributes -Wno-error=bool-compare -Wno-error=cast-align -Wno-error=clobbered -Wno-error=deprecated-declarations -Wno-error=enum-compare -Wno-error=extra -Wno-error=logical-not-parentheses -Wno-error=strict-aliasing -Wno-error=uninitialized -Wno-error=unused-function -Wno-error=unused-value -Wno-error=empty-body -Wno-error=maybe-uninitialized -Wno-error=nonnull-compare -Wno-error=shift-negative-value -Wno-error=tautological-compare -Wno-error=unused-const-variable -Wno-error=bool-operation -Wno-error=deprecated -Wno-error=expansion-to-defined -Wno-error=format-overflow -Wno-error=format-truncation -Wno-error=implicit-fallthrough -Wno-error=int-in-bool-context -Wno-error=memset-elt-size -Wno-error=noexcept-type -Wno-error=nonnull -Wno-error=pointer-compare -Wno-error=stringop-overflow -Wno-error=aggressive-loop-optimizations -Wno-error=cast-function-type -Wno-error=catch-value -Wno-error=multistatement-macros -Wno-error=restrict -Wno-error=sizeof-pointer-memaccess -Wno-error=stringop-truncation -Wno-return-type        -c /workspace/src/sbin/dhclient/convert.c -o convert.o
--- all_subdir_tests ---
--- all_subdir_tests/sys/cddl ---
===> tests/sys/cddl (all)
--- all_subdir_lib ---
--- ttyio_test.debug ---
/usr/local/x86_64-unknown-freebsd14.3/bin/objcopy --only-keep-debug ttyio_test.full ttyio_test.debug
--- ttyio_test ---
--- all_subdir_tests ---
--- all_subdir_tests/sys/capsicum ---
--- .depend.mini-me ---
--- all_subdir_lib ---
/usr/local/x86_64-unknown-freebsd14.3/bin/objcopy --strip-debug --add-gnu-debuglink=ttyio_test.debug  ttyio_test.full ttyio_test
--- all_subdir_tests ---
echo mini-me.full: /tmp/obj/workspace/src/amd64.amd64/tmp/usr/lib/libc.a  >> .depend.mini-me
--- mini-me.o ---
/usr/local/bin/x86_64-unknown-freebsd14.3-gcc13 --sysroot=/tmp/obj/workspace/src/amd64.amd64/tmp -B/usr/local/x86_64-unknown-freebsd14.3/bin/  -O2 -pipe -fno-common   -I/workspace/src/tests -g -MD  -MF.depend.mini-me.mini-me.o -MTmini-me.o -std=gnu17 -Wno-format-zero-length -fstack-protector-strong -Wsystem-headers -Werror -Wall -Wno-format-y2k -W -Wno-unused-parameter -Wmissing-prototypes -Wpointer-arith -Wreturn-type -Wcast-qual -Wwrite-strings -Wswitch -Wshadow -Wunused-parameter -Wcast-align -Wchar-subscripts -Wnested-externs -Wold-style-definition -Wno-pointer-sign -Wdate-time -Wno-error=address -Wno-error=array-bounds -Wno-error=attributes -Wno-error=bool-compare -Wno-error=cast-align -Wno-error=clobbered -Wno-error=deprecated-declarations -Wno-error=enum-compare -Wno-error=extra -Wno-error=logical-not-parentheses -Wno-error=strict-aliasing -Wno-error=uninitialized -Wno-error=unused-function -Wno-error=unused-value -Wno-error=empty-body -Wno-error=maybe-uninitialized -Wno-error=nonnull-compare -Wno-error=shift-negative-value -Wno-error=tautological-compare -Wno-error=unused-const-variable -Wno-error=bool-operation -Wno-error=deprecated -Wno-error=expansion-to-defined -Wno-error=format-overflow -Wno-error=format-truncation -Wno-error=implicit-fallthrough -Wno-error=int-in-bool-context -Wno-error=memset-elt-size -Wno-error=noexcept-type -Wno-error=nonnull -Wno-error=pointer-compare -Wno-error=stringop-overflow -Wno-error=aggressive-loop-optimizations -Wno-error=cast-function-type -Wno-error=catch-value -Wno-error=multistatement-macros -Wno-error=restrict -Wno-error=sizeof-pointer-memaccess -Wno-error=stringop-truncation -Wno-return-type      -c /workspace/src/contrib/capsicum-test/mini-me.c -o mini-me.o
--- all_subdir_lib ---
--- Kyuafile ---
--- all_subdir_tests ---
--- mini-me.noexec ---
(cd /workspace/src/tests/sys/capsicum &&  DEPENDFILE=.depend.mini-me.noexec  NO_SUBDIR=1 make -f /workspace/src/tests/sys/capsicum/Makefile _RECURSING_PROGS=t  PROG=mini-me.noexec )
--- all_subdir_tests/sys/cddl ---
--- all_subdir_tests/sys/cddl/zfs ---
===> tests/sys/cddl/zfs (all)
--- all_subdir_tests/sys/cddl/zfs/bin ---
===> tests/sys/cddl/zfs/bin (all)
--- all_subdir_tests/sys/capsicum ---
--- .depend.mini-me.noexec ---
echo mini-me.noexec.full: /tmp/obj/workspace/src/amd64.amd64/tmp/usr/lib/libc.a  >> .depend.mini-me.noexec
--- mini-me.noexec.full ---
/usr/local/bin/x86_64-unknown-freebsd14.3-gcc13 --sysroot=/tmp/obj/workspace/src/amd64.amd64/tmp -B/usr/local/x86_64-unknown-freebsd14.3/bin/ -O2 -pipe -fno-common -I/workspace/src/tests -g -std=gnu17 -Wno-format-zero-length -fstack-protector-strong -Wsystem-headers -Werror -Wall -Wno-format-y2k -W -Wno-unused-parameter -Wmissing-prototypes -Wpointer-arith -Wreturn-type -Wcast-qual -Wwrite-strings -Wswitch -Wshadow -Wunused-parameter -Wcast-align -Wchar-subscripts -Wnested-externs -Wold-style-definition -Wno-pointer-sign -Wdate-time -Wno-error=address -Wno-error=array-bounds -Wno-error=attributes -Wno-error=bool-compare -Wno-error=cast-align -Wno-error=clobbered -Wno-error=deprecated-declarations -Wno-error=enum-compare -Wno-error=extra -Wno-error=logical-not-parentheses -Wno-error=strict-aliasing -Wno-error=uninitialized -Wno-error=unused-function -Wno-error=unused-value -Wno-error=empty-body -Wno-error=maybe-uninitialized -Wno-error=nonnull-compare -Wno-error=shift-negative-value -Wno-error=tautological-compare -Wno-error=unused-const-variable -Wno-error=bool-operation -Wno-error=deprecated -Wno-error=expansion-to-defined -Wno-error=format-overflow -Wno-error=format-truncation -Wno-error=implicit-fallthrough -Wno-error=int-in-bool-context -Wno-error=memset-elt-size -Wno-error=noexcept-type -Wno-error=nonnull -Wno-error=pointer-compare -Wno-error=stringop-overflow -Wno-error=aggressive-loop-optimizations -Wno-error=cast-function-type -Wno-error=catch-value -Wno-error=multistatement-macros -Wno-error=restrict -Wno-error=sizeof-pointer-memaccess -Wno-error=stringop-truncation -Wno-return-type  -Wl,-zrelro -static -Wl,-znoexecstack  -o mini-me.noexec.full mini-me.o  
--- all_subdir_lib ---
--- all_subdir_lib/libc/tests/sys ---
--- stat_test.full ---
--- all_subdir_tests ---
--- mini-me ---
--- mini-me.full ---
/usr/local/bin/x86_64-unknown-freebsd14.3-gcc13 --sysroot=/tmp/obj/workspace/src/amd64.amd64/tmp -B/usr/local/x86_64-unknown-freebsd14.3/bin/ -O2 -pipe -fno-common -I/workspace/src/tests -g -std=gnu17 -Wno-format-zero-length -fstack-protector-strong -Wsystem-headers -Werror -Wall -Wno-format-y2k -W -Wno-unused-parameter -Wmissing-prototypes -Wpointer-arith -Wreturn-type -Wcast-qual -Wwrite-strings -Wswitch -Wshadow -Wunused-parameter -Wcast-align -Wchar-subscripts -Wnested-externs -Wold-style-definition -Wno-pointer-sign -Wdate-time -Wno-error=address -Wno-error=array-bounds -Wno-error=attributes -Wno-error=bool-compare -Wno-error=cast-align -Wno-error=clobbered -Wno-error=deprecated-declarations -Wno-error=enum-compare -Wno-error=extra -Wno-error=logical-not-parentheses -Wno-error=strict-aliasing -Wno-error=uninitialized -Wno-error=unused-function -Wno-error=unused-value -Wno-error=empty-body -Wno-error=maybe-uninitialized -Wno-error=nonnull-compare -Wno-error=shift-negative-value -Wno-error=tautological-compare -Wno-error=unused-const-variable -Wno-error=bool-operation -Wno-error=deprecated -Wno-error=expansion-to-defined -Wno-error=format-overflow -Wno-error=format-truncation -Wno-error=implicit-fallthrough -Wno-error=int-in-bool-context -Wno-error=memset-elt-size -Wno-error=noexcept-type -Wno-error=nonnull -Wno-error=pointer-compare -Wno-error=stringop-overflow -Wno-error=aggressive-loop-optimizations -Wno-error=cast-function-type -Wno-error=catch-value -Wno-error=multistatement-macros -Wno-error=restrict -Wno-error=sizeof-pointer-memaccess -Wno-error=stringop-truncation -Wno-return-type  -Wl,-zrelro -static -Wl,-znoexecstack  -o mini-me.full mini-me.o  
--- all_subdir_lib ---
/usr/local/bin/x86_64-unknown-freebsd14.3-gcc13 --sysroot=/tmp/obj/workspace/src/amd64.amd64/tmp -B/usr/local/x86_64-unknown-freebsd14.3/bin/ -O2 -pipe -fno-common -I/workspace/src/lib/libnetbsd -I/workspace/src/contrib/netbsd-tests -fPIE -g -std=gnu17 -Wno-format-zero-length -fstack-protector-strong -Wsystem-headers -Werror -Wall -Wno-format-y2k -Wno-uninitialized -Wno-pointer-sign -Wdate-time -Wno-error=address -Wno-error=array-bounds -Wno-error=attributes -Wno-error=bool-compare -Wno-error=cast-align -Wno-error=clobbered -Wno-error=deprecated-declarations -Wno-error=enum-compare -Wno-error=extra -Wno-error=logical-not-parentheses -Wno-error=strict-aliasing -Wno-error=uninitialized -Wno-error=unused-function -Wno-error=unused-value -Wno-error=empty-body -Wno-error=maybe-uninitialized -Wno-error=nonnull-compare -Wno-error=shift-negative-value -Wno-error=tautological-compare -Wno-error=unused-const-variable -Wno-error=bool-operation -Wno-error=deprecated -Wno-error=expansion-to-defined -Wno-error=format-overflow -Wno-error=format-truncation -Wno-error=implicit-fallthrough -Wno-error=int-in-bool-context -Wno-error=memset-elt-size -Wno-error=noexcept-type -Wno-error=nonnull -Wno-error=pointer-compare -Wno-error=stringop-overflow -Wno-error=aggressive-loop-optimizations -Wno-error=cast-function-type -Wno-error=catch-value -Wno-error=multistatement-macros -Wno-error=restrict -Wno-error=sizeof-pointer-memaccess -Wno-error=stringop-truncation -Wno-return-type -Wno-address-of-packed-member  -L/tmp/obj/workspace/src/amd64.amd64/lib/libnetbsd -Wl,-zrelro -pie -Wl,-znoexecstack  -o stat_test.full t_stat.pieo  -lprivateatf-c -L/tmp/obj/workspace/src/amd64.amd64/lib/libnetbsd -lnetbsd_pie
--- all_subdir_tests ---
--- all_subdir_tests/sys/cddl ---
--- chg_usr_exec ---
(cd /workspace/src/tests/sys/cddl/zfs/bin &&  DEPENDFILE=.depend.chg_usr_exec  NO_SUBDIR=1 make -f /workspace/src/tests/sys/cddl/zfs/bin/Makefile _RECURSING_PROGS=t  PROG=chg_usr_exec )
--- all_subdir_rescue ---
--- tables.o ---
/usr/local/bin/x86_64-unknown-freebsd14.3-gcc13 --sysroot=/tmp/obj/workspace/src/amd64.amd64/tmp -B/usr/local/x86_64-unknown-freebsd14.3/bin/  -O2 -pipe -fno-common   -DRESCUE -I/tmp/obj/workspace/src/amd64.amd64/lib/libifconfig -I/tmp/obj/workspace/src/amd64.amd64/lib/libiscsiutil -g -MD  -MF.depend.tables.o -MTtables.o -std=gnu17 -Wno-format-zero-length -fstack-protector-strong -Wsystem-headers -Werror -Wall -Wno-format-y2k -W -Wno-unused-parameter -Wmissing-prototypes -Wpointer-arith -Wreturn-type -Wcast-qual -Wwrite-strings -Wswitch -Wshadow -Wunused-parameter -Wchar-subscripts -Wnested-externs -Wold-style-definition -Wno-pointer-sign -Wdate-time -Wno-error=address -Wno-error=array-bounds -Wno-error=attributes -Wno-error=bool-compare -Wno-error=cast-align -Wno-error=clobbered -Wno-error=deprecated-declarations -Wno-error=enum-compare -Wno-error=extra -Wno-error=logical-not-parentheses -Wno-error=strict-aliasing -Wno-error=uninitialized -Wno-error=unused-function -Wno-error=unused-value -Wno-error=empty-body -Wno-error=maybe-uninitialized -Wno-error=nonnull-compare -Wno-error=shift-negative-value -Wno-error=tautological-compare -Wno-error=unused-const-variable -Wno-error=bool-operation -Wno-error=deprecated -Wno-error=expansion-to-defined -Wno-error=format-overflow -Wno-error=format-truncation -Wno-error=implicit-fallthrough -Wno-error=int-in-bool-context -Wno-error=memset-elt-size -Wno-error=noexcept-type -Wno-error=nonnull -Wno-error=pointer-compare -Wno-error=stringop-overflow -Wno-error=aggressive-loop-optimizations -Wno-error=cast-function-type -Wno-error=catch-value -Wno-error=multistatement-macros -Wno-error=restrict -Wno-error=sizeof-pointer-memaccess -Wno-error=stringop-truncation -Wno-return-type        -c /workspace/src/sbin/dhclient/tables.c -o tables.o
--- all_subdir_tests ---
--- .depend.chg_usr_exec ---
echo chg_usr_exec.full: /tmp/obj/workspace/src/amd64.amd64/tmp/usr/lib/libc.a  >> .depend.chg_usr_exec
--- chg_usr_exec.pieo ---
/usr/local/bin/x86_64-unknown-freebsd14.3-gcc13 --sysroot=/tmp/obj/workspace/src/amd64.amd64/tmp -B/usr/local/x86_64-unknown-freebsd14.3/bin/ -fpie -DPIC   -O2 -pipe -fno-common   -fPIE -g -MD  -MF.depend.chg_usr_exec.chg_usr_exec.pieo -MTchg_usr_exec.pieo -std=gnu17 -Wno-format-zero-length -fstack-protector-strong -Wno-pointer-sign -Wdate-time -Wno-error=address -Wno-error=array-bounds -Wno-error=attributes -Wno-error=bool-compare -Wno-error=cast-align -Wno-error=clobbered -Wno-error=deprecated-declarations -Wno-error=enum-compare -Wno-error=extra -Wno-error=logical-not-parentheses -Wno-error=strict-aliasing -Wno-error=uninitialized -Wno-error=unused-function -Wno-error=unused-value -Wno-error=empty-body -Wno-error=maybe-uninitialized -Wno-error=nonnull-compare -Wno-error=shift-negative-value -Wno-error=tautological-compare -Wno-error=unused-const-variable -Wno-error=bool-operation -Wno-error=deprecated -Wno-error=expansion-to-defined -Wno-error=format-overflow -Wno-error=format-truncation -Wno-error=implicit-fallthrough -Wno-error=int-in-bool-context -Wno-error=memset-elt-size -Wno-error=noexcept-type -Wno-error=nonnull -Wno-error=pointer-compare -Wno-error=stringop-overflow -Wno-error=aggressive-loop-optimizations -Wno-error=cast-function-type -Wno-error=catch-value -Wno-error=multistatement-macros -Wno-error=restrict -Wno-error=sizeof-pointer-memaccess -Wno-error=stringop-truncation -Wno-return-type -Wno-address-of-packed-member      -c /workspace/src/tests/sys/cddl/zfs/bin/chg_usr_exec.c -o chg_usr_exec.pieo
--- all_subdir_lib ---
--- stat_test.debug ---
/usr/local/x86_64-unknown-freebsd14.3/bin/objcopy --only-keep-debug stat_test.full stat_test.debug
--- stat_test ---
/usr/local/x86_64-unknown-freebsd14.3/bin/objcopy --strip-debug --add-gnu-debuglink=stat_test.debug  stat_test.full stat_test
--- timer_create_test ---
(cd /workspace/src/lib/libc/tests/sys &&  DEPENDFILE=.depend.timer_create_test  NO_SUBDIR=1 make -f /workspace/src/lib/libc/tests/sys/Makefile _RECURSING_PROGS=t  PROG=timer_create_test )
--- .depend.timer_create_test ---
echo timer_create_test.full: /tmp/obj/workspace/src/amd64.amd64/tmp/usr/lib/libc.a /tmp/obj/workspace/src/amd64.amd64/tmp/usr/lib/libprivateatf-c.a /tmp/obj/workspace/src/amd64.amd64/tmp/usr/lib/librt.a /tmp/obj/workspace/src/amd64.amd64/lib/libnetbsd/libnetbsd_pie.a >> .depend.timer_create_test
--- all_subdir_tests ---
--- chg_usr_exec.full ---
--- all_subdir_lib ---
--- t_timer_create.pieo ---
--- all_subdir_tests ---
/usr/local/bin/x86_64-unknown-freebsd14.3-gcc13 --sysroot=/tmp/obj/workspace/src/amd64.amd64/tmp -B/usr/local/x86_64-unknown-freebsd14.3/bin/ -O2 -pipe -fno-common -fPIE -g -std=gnu17 -Wno-format-zero-length -fstack-protector-strong -Wno-pointer-sign -Wdate-time -Wno-error=address -Wno-error=array-bounds -Wno-error=attributes -Wno-error=bool-compare -Wno-error=cast-align -Wno-error=clobbered -Wno-error=deprecated-declarations -Wno-error=enum-compare -Wno-error=extra -Wno-error=logical-not-parentheses -Wno-error=strict-aliasing -Wno-error=uninitialized -Wno-error=unused-function -Wno-error=unused-value -Wno-error=empty-body -Wno-error=maybe-uninitialized -Wno-error=nonnull-compare -Wno-error=shift-negative-value -Wno-error=tautological-compare -Wno-error=unused-const-variable -Wno-error=bool-operation -Wno-error=deprecated -Wno-error=expansion-to-defined -Wno-error=format-overflow -Wno-error=format-truncation -Wno-error=implicit-fallthrough -Wno-error=int-in-bool-context -Wno-error=memset-elt-size -Wno-error=n--- all_subdir_lib ---
/usr/local/bin/x86_64-unknown-freebsd14.3-gcc13 --sysroot=/tmp/obj/workspace/src/amd64.amd64/tmp -B/usr/local/x86_64-unknown-freebsd14.3/bin/ -fpie -DPIC   -O2 -pipe -fno-common   -I/workspace/src/lib/libnetbsd -I/workspace/src/contrib/netbsd-tests -fPIE -g -MD  -MF.depend.timer_create_test.t_timer_create.pieo -MTt_timer_create.pieo -std=gnu17 -Wno-format-zero-length -fstack-protector-strong -Wsystem-headers -Werror -Wall -Wno-format-y2k -Wno-uninitialized -Wno-pointer-sign -Wdate-time -Wno-error=address -Wno-error=array-bounds -Wno-error=attributes -Wno-error=bool-compare -Wno-error=cast-align -Wno-error=clobbered -Wno-error=deprecated-declarations -Wno-error=enum-compare -Wno-error=extra -Wno-error=logical-not-parentheses -Wno-error=strict-aliasing -Wno-error=uninitialized -Wno-error=unused-function -Wno-error=unused-value -Wno-error=empty-body -Wno-error=maybe-uninitialized -Wno-error=nonnull-compare -Wno-error=shift-negative-value -Wno-error=tautological-compare -Wno-error=unused-const-variable -Wno-error--- all_subdir_tests ---
oexcept-type -Wno-error=nonnull -Wno-error=pointer-compare -Wno-error=stringop-overflow -Wno-error=aggressive-loop-optimizations -Wno-error=cast-function-type -Wno-error=catch-value -Wno-error=multistatement-macros -Wno-error=restrict -Wno-error=sizeof-pointer-memaccess -Wno-error=stringop-truncation -Wno-return-type -Wno-address-of-packed-member  -Wl,-zrelro -pie -Wl,-znoexecstack  -o chg_usr_exec.full chg_usr_exec.pieo  
--- all_subdir_lib ---
=bool-operation -Wno-error=deprecated -Wno-error=expansion-to-defined -Wno-error=format-overflow -Wno-error=format-truncation -Wno-error=implicit-fallthrough -Wno-error=int-in-bool-context -Wno-error=memset-elt-size -Wno-error=noexcept-type -Wno-error=nonnull -Wno-error=pointer-compare -Wno-error=stringop-overflow -Wno-error=aggressive-loop-optimizations -Wno-error=cast-function-type -Wno-error=catch-value -Wno-error=multistatement-macros -Wno-error=restrict -Wno-error=sizeof-pointer-memaccess -Wno-error=stringop-truncation -Wno-return-type -Wno-address-of-packed-member      -c /workspace/src/contrib/netbsd-tests/lib/libc/sys/t_timer_create.c -o t_timer_create.pieo
--- all_subdir_rescue ---
--- parse.o ---
/usr/local/bin/x86_64-unknown-freebsd14.3-gcc13 --sysroot=/tmp/obj/workspace/src/amd64.amd64/tmp -B/usr/local/x86_64-unknown-freebsd14.3/bin/  -O2 -pipe -fno-common   -DRESCUE -I/tmp/obj/workspace/src/amd64.amd64/lib/libifconfig -I/tmp/obj/workspace/src/amd64.amd64/lib/libiscsiutil -g -MD  -MF.depend.parse.o -MTparse.o -std=gnu17 -Wno-format-zero-length -fstack-protector-strong -Wsystem-headers -Werror -Wall -Wno-format-y2k -W -Wno-unused-parameter -Wmissing-prototypes -Wpointer-arith -Wreturn-type -Wcast-qual -Wwrite-strings -Wswitch -Wshadow -Wunused-parameter -Wchar-subscripts -Wnested-externs -Wold-style-definition -Wno-pointer-sign -Wdate-time -Wno-error=address -Wno-error=array-bounds -Wno-error=attributes -Wno-error=bool-compare -Wno-error=cast-align -Wno-error=clobbered -Wno-error=deprecated-declarations -Wno-error=enum-compare -Wno-error=extra -Wno-error=logical-not-parentheses -Wno-error=strict-aliasing -Wno-error=uninitialized -Wno-error=unused-function -Wno-error=unused-value -Wno-error=empty-body -Wno-error=maybe-uninitialized -Wno-error=nonnull-compare -Wno-error=shift-negative-value -Wno-error=tautological-compare -Wno-error=unused-const-variable -Wno-error=bool-operation -Wno-error=deprecated -Wno-error=expansion-to-defined -Wno-error=format-overflow -Wno-error=format-truncation -Wno-error=implicit-fallthrough -Wno-error=int-in-bool-context -Wno-error=memset-elt-size -Wno-error=noexcept-type -Wno-error=nonnull -Wno-error=pointer-compare -Wno-error=stringop-overflow -Wno-error=aggressive-loop-optimizations -Wno-error=cast-function-type -Wno-error=catch-value -Wno-error=multistatement-macros -Wno-error=restrict -Wno-error=sizeof-pointer-memaccess -Wno-error=stringop-truncation -Wno-return-type        -c /workspace/src/sbin/dhclient/parse.c -o parse.o
--- all_subdir_tests ---
--- chg_usr_exec.debug ---
/usr/local/x86_64-unknown-freebsd14.3/bin/objcopy --only-keep-debug chg_usr_exec.full chg_usr_exec.debug
--- all_subdir_usr.sbin ---
--- all_subdir_usr.sbin/mptutil ---
--- mpt_volume.pieo ---
/usr/local/bin/x86_64-unknown-freebsd14.3-gcc13 --sysroot=/tmp/obj/workspace/src/amd64.amd64/tmp -B/usr/local/x86_64-unknown-freebsd14.3/bin/ -fpie -DPIC   -O2 -pipe -fno-common   -fPIE -g -MD  -MF.depend.mpt_volume.pieo -MTmpt_volume.pieo -std=gnu17 -Wno-format-zero-length -fstack-protector-strong -Wsystem-headers -Werror -Wall -Wno-format-y2k -W -Wno-unused-parameter -Wmissing-prototypes -Wpointer-arith -Wno-uninitialized -Wno-pointer-sign -Wdate-time -Wno-error=address -Wno-error=array-bounds -Wno-error=attributes -Wno-error=bool-compare -Wno-error=cast-align -Wno-error=clobbered -Wno-error=deprecated-declarations -Wno-error=enum-compare -Wno-error=extra -Wno-error=logical-not-parentheses -Wno-error=strict-aliasing -Wno-error=uninitialized -Wno-error=unused-function -Wno-error=unused-value -Wno-error=empty-body -Wno-error=maybe-uninitialized -Wno-error=nonnull-compare -Wno-error=shift-negative-value -Wno-error=tautological-compare -Wno-error=unused-const-variable -Wno-error=bool-operation -Wno-error=deprecated -Wno-error=expansion-to-defined -Wno-error=format-overflow -Wno-error=format-truncation -Wno-error=implicit-fallthrough -Wno-error=int-in-bool-context -Wno-error=memset-elt-size -Wno-error=noexcept-type -Wno-error=nonnull -Wno-error=pointer-compare -Wno-error=stringop-overflow -Wno-error=aggressive-loop-optimizations -Wno-error=cast-function-type -Wno-error=catch-value -Wno-error=multistatement-macros -Wno-error=restrict -Wno-error=sizeof-pointer-memaccess -Wno-error=stringop-truncation -Wno-return-type -Wno-address-of-packed-member        -c /workspace/src/usr.sbin/mptutil/mpt_volume.c -o mpt_volume.pieo
--- all_subdir_tests ---
--- chg_usr_exec ---
/usr/local/x86_64-unknown-freebsd14.3/bin/objcopy --strip-debug --add-gnu-debuglink=chg_usr_exec.debug  chg_usr_exec.full chg_usr_exec
--- dir_rd_update ---
(cd /workspace/src/tests/sys/cddl/zfs/bin &&  DEPENDFILE=.depend.dir_rd_update  NO_SUBDIR=1 make -f /workspace/src/tests/sys/cddl/zfs/bin/Makefile _RECURSING_PROGS=t  PROG=dir_rd_update )
--- all_subdir_tests/sys/capsicum ---
--- mini-me.noexec ---
/usr/local/bin/x86_64-unknown-freebsd14.3-ld: /tmp/obj/workspace/src/amd64.amd64/tmp/usr/lib/crt1.o: in function `_start':
/workspace/src/lib/csu/amd64/crt1_s.S:66:(.text+0x17): undefined reference to `main'
--- all_subdir_tests/sys/cddl ---
--- .depend.dir_rd_update ---
echo dir_rd_update.full: /tmp/obj/workspace/src/amd64.amd64/tmp/usr/lib/libc.a  >> .depend.dir_rd_update
--- dir_rd_update.pieo ---
/usr/local/bin/x86_64-unknown-freebsd14.3-gcc13 --sysroot=/tmp/obj/workspace/src/amd64.amd64/tmp -B/usr/local/x86_64-unknown-freebsd14.3/bin/ -fpie -DPIC   -O2 -pipe -fno-common   -fPIE -g -MD  -MF.depend.dir_rd_update.dir_rd_update.pieo -MTdir_rd_update.pieo -std=gnu17 -Wno-format-zero-length -fstack-protector-strong -Wno-pointer-sign -Wdate-time -Wno-error=address -Wno-error=array-bounds -Wno-error=attributes -Wno-error=bool-compare -Wno-error=cast-align -Wno-error=clobbered -Wno-error=deprecated-declarations -Wno-error=enum-compare -Wno-error=extra -Wno-error=logical-not-parentheses -Wno-error=strict-aliasing -Wno-error=uninitialized -Wno-error=unused-function -Wno-error=unused-value -Wno-error=empty-body -Wno-error=maybe-uninitialized -Wno-error=nonnull-compare -Wno-error=shift-negative-value -Wno-error=tautological-compare -Wno-error=unused-const-variable -Wno-error=bool-operation -Wno-error=deprecated -Wno-error=expansion-to-defined -Wno-error=format-overflow -Wno-error=format-truncation -Wno-error=implicit-fallthrough -Wno-error=int-in-bool-context -Wno-error=memset-elt-size -Wno-error=noexcept-type -Wno-error=nonnull -Wno-error=pointer-compare -Wno-error=stringop-overflow -Wno-error=aggressive-loop-optimizations -Wno-error=cast-function-type -Wno-error=catch-value -Wno-error=multistatement-macros -Wno-error=restrict -Wno-error=sizeof-pointer-memaccess -Wno-error=stringop-truncation -Wno-return-type -Wno-address-of-packed-member      -c /workspace/src/tests/sys/cddl/zfs/bin/dir_rd_update.c -o dir_rd_update.pieo
--- all_subdir_tests/sys/capsicum ---
collect2: error: ld returned 1 exit status
*** [mini-me.noexec.full] Error code 1

make[6]: stopped in /workspace/src/tests/sys/capsicum
1 error

make[6]: stopped in /workspace/src/tests/sys/capsicum

make[5]: stopped in /workspace/src/tests/sys/capsicum

make[3]: stopped in /workspace/src/tests

make[2]: stopped in /workspace/src
--- all_subdir_usr.bin ---

make[2]: stopped in /workspace/src
--- all_subdir_lib ---

make[3]: stopped in /workspace/src/lib

make[2]: stopped in /workspace/src
--- all_subdir_rescue ---
*** [objs] Error code 6

make[4]: stopped in /workspace/src/rescue/rescue
1 error
--- all_subdir_usr.sbin ---

make[2]: stopped in /workspace/src
--- all_subdir_rescue ---

make[4]: stopped in /workspace/src/rescue/rescue

make[3]: stopped in /workspace/src/rescue

make[2]: stopped in /workspace/src
--- all_subdir_cddl ---

make[6]: stopped in /workspace/src/cddl/usr.sbin/zfsd/tests

make[5]: stopped in /workspace/src/cddl/usr.sbin/zfsd

make[4]: stopped in /workspace/src/cddl/usr.sbin

make[3]: stopped in /workspace/src/cddl

make[2]: stopped in /workspace/src
      212.32 real      1879.21 user       162.27 sys

make[1]: stopped in /workspace/src

make: stopped in /workspace/src
Build step 'Execute shell' marked build as failure
[WARNINGS]Skipping publisher since build result is FAILURE
[PostBuildScript] - [INFO] Executing post build scripts.
[FreeBSD-main-amd64-gcc13_build] $ /bin/sh -xe /tmp/jenkins1325885031873832173.sh
+ sh freebsd-ci/scripts/jail/clean.sh
clean jail FreeBSD-main-amd64-gcc13_build
Checking for post-build
Performing post-build step
Checking if email needs to be generated
Email was triggered for: Failure - Any
Sending email for trigger: Failure - Any
Sending mail from default account using System Admin e-mail address