FreeBSD-stable-15-amd64-test - Build #255 - Still Unstable

From: <jenkins-admin_at_FreeBSD.org>
Date: Mon, 24 Nov 2025 15:26:02 UTC
FreeBSD-stable-15-amd64-test - Build #255 (4991bb6a5c45b518df9b1a265c4f6f8c17ea4493) - Still Unstable

Build information: https://ci.FreeBSD.org/job/FreeBSD-stable-15-amd64-test/255/
Full change log: https://ci.FreeBSD.org/job/FreeBSD-stable-15-amd64-test/255/changes
Full build log: https://ci.FreeBSD.org/job/FreeBSD-stable-15-amd64-test/255/console

Status explanation:
"Unstable" - some tests are suspected being broken by the following changes
"Still Unstable" - the failing test cases have not been fixed by these
                   following changes and this is a notification to note that
                   these changes have not been fully tested by the CI system

Change summaries:
(Those commits are likely but not certainly responsible)

4991bb6a5c45b518df9b1a265c4f6f8c17ea4493 by christos:
snd_hda: Patch Lenovo V15



The failed test cases:

3 tests failed.
FAILED:  sys.netpfil.pf.route_to.prefer_ipv6_nexthop_mixed_af_random_table_ipv4

Error Message:
Target 2001:db8:4202::42:4 not selected after 10 attempts!

FAILED:  usr.sbin.syslogd.syslogd_forwarded_format_test.O_flag_bsd_forwarded_legacy

Error Message:
Test case body timed out

FAILED:  sys.netlink.test_netlink_message_writer.py.__test_cases_list__

Error Message:
Test program did not exit cleanly