FreeBSD-stable-15-amd64-gcc13_build - Build #247 - Still Failing
Date: Mon, 17 Nov 2025 17:41:33 UTC
FreeBSD-stable-15-amd64-gcc13_build - Build #247 (cf3e1dc5f59e13252ef314bd4f72e19c38115840) - Still Failing
Build information: https://ci.FreeBSD.org/job/FreeBSD-stable-15-amd64-gcc13_build/247/
Full change log: https://ci.FreeBSD.org/job/FreeBSD-stable-15-amd64-gcc13_build/247/changes
Full build log: https://ci.FreeBSD.org/job/FreeBSD-stable-15-amd64-gcc13_build/247/console
Status explanation:
"Failure" - the build is suspected being broken by the following changes
"Still Failing" - the build has not been fixed by the following changes and
this is a notification to note that these changes have
not been fully tested by the CI system
Change summaries:
(Those commits are likely but not certainly responsible)
cf3e1dc5f59e13252ef314bd4f72e19c38115840 by emaste:
newfs_msdos: Improve error messages
The end of the build log:
[...truncated 99.11 MiB...]
--- all_subdir_lib ---
--- all_subdir_lib/libc/tests/stdlib ---
--- libatexit.so.debug ---
--- all_subdir_lib/libc/tests/sys ---
--- cpuset_test ---
--- .depend.cpuset_test ---
--- all_subdir_lib/libc/tests/stdlib ---
/usr/local/x86_64-unknown-freebsd14.3/bin/objcopy --only-keep-debug libatexit.so.full libatexit.so.debug
--- all_subdir_lib/libc/tests/sys ---
echo cpuset_test.full: /tmp/obj/workspace/src/amd64.amd64/tmp/usr/lib/libc.a /tmp/obj/workspace/src/amd64.amd64/tmp/usr/lib/libprivateatf-c.a >> .depend.cpuset_test
--- all_subdir_tests ---
--- Kyuafile ---
--- all_subdir_lib ---
--- cpuset_test.pieo ---
/usr/local/bin/x86_64-unknown-freebsd14.3-gcc13 --sysroot=/tmp/obj/workspace/src/amd64.amd64/tmp -B/usr/local/x86_64-unknown-freebsd14.3/bin/ -fpie -DPIC -O2 -pipe -fno-common -fPIE -ffile-prefix-map=/workspace/src=/usr/src -ffile-prefix-map=/tmp/obj/workspace/src=/usr/obj -g -MD -MF.depend.cpuset_test.cpuset_test.pieo -MTcpuset_test.pieo -std=gnu17 -Wno-format-zero-length -fstack-protector-strong -Wsystem-headers -Werror -Wall -Wno-format-y2k -Wno-uninitialized -Wno-pointer-sign -Wdate-time -Wno-error=address -Wno-error=array-bounds -Wno-error=attributes -Wno-error=bool-compare -Wno-error=cast-align -Wno-error=clobbered -Wno-error=deprecated-declarations -Wno-error=enum-compare -Wno-error=extra -Wno-error=logical-not-parentheses -Wno-error=strict-aliasing -Wno-error=uninitialized -Wno-error=unused-function -Wno-error=unused-value -Wno-error=empty-body -Wno-error=maybe-uninitialized -Wno-error=nonnull-compare -Wno-error=shift-negative-value -Wno-error=tautological-compare -Wno-error=unused-const-variable -Wno-error=bool-operation -Wno-error=deprecated -Wno-error=expansion-to-defined -Wno-error=format-overflow -Wno-error=format-truncation -Wno-error=implicit-fallthrough -Wno-error=int-in-bool-context -Wno-error=memset-elt-size -Wno-error=noexcept-type -Wno-error=nonnull -Wno-error=pointer-compare -Wno-error=stringop-overflow -Wno-error=aggressive-loop-optimizations -Wno-error=cast-function-type -Wno-error=catch-value -Wno-error=multistatement-macros -Wno-error=restrict -Wno-error=sizeof-pointer-memaccess -Wno-error=stringop-truncation -Wno-return-type -Wno-address-of-packed-member -c /workspace/src/lib/libc/tests/sys/cpuset_test.c -o cpuset_test.pieo
--- all_subdir_lib/libc/tests/string ---
--- .depend.swab_test ---
--- all_subdir_lib/libc/tests/stdlib ---
--- libatexit.so ---
--- all_subdir_lib/libc/tests/string ---
echo swab_test.full: /tmp/obj/workspace/src/amd64.amd64/tmp/usr/lib/libc.a /tmp/obj/workspace/src/amd64.amd64/tmp/usr/lib/libprivateatf-c.a /tmp/obj/workspace/src/amd64.amd64/lib/libnetbsd/libnetbsd_pie.a >> .depend.swab_test
--- all_subdir_lib/libc/tests/stdlib ---
/usr/local/x86_64-unknown-freebsd14.3/bin/objcopy --strip-debug --add-gnu-debuglink=libatexit.so.debug libatexit.so.full libatexit.so
--- all_subdir_lib/libc/tests/termios ---
===> lib/libc/tests/termios (all)
--- all_subdir_lib/libc/tests/stdlib ---
--- getopt_test ---
echo '#! /usr/libexec/atf-sh' > getopt_test.tmp
cat /workspace/src/contrib/netbsd-tests/lib/libc/stdlib/t_getopt.sh >>getopt_test.tmp
chmod +x getopt_test.tmp
mv getopt_test.tmp getopt_test
--- Kyuafile ---
--- all_subdir_lib/libc/tests/termios ---
--- tcsetpgrp_test ---
--- all_subdir_sbin ---
--- all_subdir_sbin/ipfw ---
--- nat64clat.pieo ---
--- all_subdir_lib ---
(cd /workspace/src/lib/libc/tests/termios && DEPENDFILE=.depend.tcsetpgrp_test NO_SUBDIR=1 make -f /workspace/src/lib/libc/tests/termios/Makefile _RECURSING_PROGS=t PROG=tcsetpgrp_test )
--- all_subdir_sbin ---
/usr/local/bin/x86_64-unknown-freebsd14.3-gcc13 --sysroot=/tmp/obj/workspace/src/amd64.amd64/tmp -B/usr/local/x86_64-unknown-freebsd14.3/bin/ -fpie -DPIC -O2 -pipe -fno-common -DPF -fPIE -ffile-prefix-map=/workspace/src=/usr/src -ffile-prefix-map=/tmp/obj/workspace/src=/usr/obj -g -MD -MF.depend.nat64clat.pieo -MTnat64clat.pieo -std=gnu17 -Wno-format-zero-length -fstack-protector-strong -Wsystem-headers -Werror -Wall -Wno-format-y2k -W -Wno-unused-parameter -Wmissing-prototypes -Wpointer-arith -Wreturn-type -Wcast-qual -Wwrite-strings -Wswitch -Wshadow -Wunused-parameter -Wcast-align -Wchar-subscripts -Wnested-externs -Wold-style-definition -Wno-pointer-sign -Wdate-time -Wno-error=address -Wno-error=array-bounds -Wno-error=attributes -Wno-error=bool-compare -Wno-error=cast-align -Wno-error=clobbered -Wno-error=deprecated-declarations -Wno-error=enum-compare -Wno-error=extra -Wno-error=logical-not-parentheses -Wno-error=strict-aliasing -Wno-error=uninitialized -Wno-error=unused-function -Wno-error=unused-value -Wno-error=empty-body -Wno-error=maybe-uninitialized -Wno-error=nonnull-compare -Wno-error=shift-negative-value -Wno-error=tautological-compare -Wno-error=unused-const-variable -Wno-error=bool-operation -Wno-error=deprecated -Wno-error=expansion-to-defined -Wno-error=format-overflow -Wno-error=format-truncation -Wno-error=implicit-fallthrough -Wno-error=int-in-bool-context -Wno-error=memset-elt-size -Wno-error=noexcept-type -Wno-error=nonnull -Wno-error=pointer-compare -Wno-error=stringop-overflow -Wno-error=aggressive-loop-optimizations -Wno-error=cast-function-type -Wno-error=catch-value -Wno-error=multistatement-macros -Wno-error=restrict -Wno-error=sizeof-pointer-memaccess -Wno-error=stringop-truncation -Wno-return-type -Wno-cast-align -c /workspace/src/sbin/ipfw/nat64clat.c -o nat64clat.pieo
--- all_subdir_lib ---
--- .depend.tcsetpgrp_test ---
echo tcsetpgrp_test.full: /tmp/obj/workspace/src/amd64.amd64/tmp/usr/lib/libc.a /tmp/obj/workspace/src/amd64.amd64/tmp/usr/lib/libprivateatf-c.a /tmp/obj/workspace/src/amd64.amd64/lib/libnetbsd/libnetbsd_pie.a >> .depend.tcsetpgrp_test
--- t_tcsetpgrp.pieo ---
/usr/local/bin/x86_64-unknown-freebsd14.3-gcc13 --sysroot=/tmp/obj/workspace/src/amd64.amd64/tmp -B/usr/local/x86_64-unknown-freebsd14.3/bin/ -fpie -DPIC -O2 -pipe -fno-common -I/workspace/src/lib/libnetbsd -I/workspace/src/contrib/netbsd-tests -fPIE -ffile-prefix-map=/workspace/src=/usr/src -ffile-prefix-map=/tmp/obj/workspace/src=/usr/obj -g -MD -MF.depend.tcsetpgrp_test.t_tcsetpgrp.pieo -MTt_tcsetpgrp.pieo -std=gnu17 -Wno-format-zero-length -fstack-protector-strong -Wsystem-headers -Werror -Wall -Wno-format-y2k -Wno-uninitialized -Wno-pointer-sign -Wdate-time -Wno-error=address -Wno-error=array-bounds -Wno-error=attributes -Wno-error=bool-compare -Wno-error=cast-align -Wno-error=clobbered -Wno-error=deprecated-declarations -Wno-error=enum-compare -Wno-error=extra -Wno-error=logical-not-parentheses -Wno-error=strict-aliasing -Wno-error=uninitialized -Wno-error=unused-function -Wno-error=unused-value -Wno-error=empty-body -Wno-error=maybe-uninitialized -Wno-error=nonnull-compare -Wno-error=shift-negative-value -Wno-error=tautological-compare -Wno-error=unused-const-variable -Wno-error=bool-operation -Wno-error=deprecated -Wno-error=expansion-to-defined -Wno-error=format-overflow -Wno-error=format-truncation -Wno-error=implicit-fallthrough -Wno-error=int-in-bool-context -Wno-error=memset-elt-size -Wno-error=noexcept-type -Wno-error=nonnull -Wno-error=pointer-compare -Wno-error=stringop-overflow -Wno-error=aggressive-loop-optimizations -Wno-error=cast-function-type -Wno-error=catch-value -Wno-error=multistatement-macros -Wno-error=restrict -Wno-error=sizeof-pointer-memaccess -Wno-error=stringop-truncation -Wno-return-type -Wno-address-of-packed-member -c /workspace/src/contrib/netbsd-tests/lib/libc/termios/t_tcsetpgrp.c -o t_tcsetpgrp.pieo
--- all_subdir_lib/libc/tests/string ---
--- t_swab.pieo ---
/usr/local/bin/x86_64-unknown-freebsd14.3-gcc13 --sysroot=/tmp/obj/workspace/src/amd64.amd64/tmp -B/usr/local/x86_64-unknown-freebsd14.3/bin/ -fpie -DPIC -O2 -pipe -fno-common -fno-builtin -I/workspace/src/lib/libnetbsd -I/workspace/src/contrib/netbsd-tests -fPIE -ffile-prefix-map=/workspace/src=/usr/src -ffile-prefix-map=/tmp/obj/workspace/src=/usr/obj -g -MD -MF.depend.swab_test.t_swab.pieo -MTt_swab.pieo -std=gnu17 -Wno-format-zero-length -fstack-protector-strong -Wsystem-headers -Werror -Wall -Wno-format-y2k -Wno-uninitialized -Wno-pointer-sign -Wdate-time -Wno-error=address -Wno-error=array-bounds -Wno-error=attributes -Wno-error=bool-compare -Wno-error=cast-align -Wno-error=clobbered -Wno-error=deprecated-declarations -Wno-error=enum-compare -Wno-error=extra -Wno-error=logical-not-parentheses -Wno-error=strict-aliasing -Wno-error=uninitialized -Wno-error=unused-function -Wno-error=unused-value -Wno-error=empty-body -Wno-error=maybe-uninitialized -Wno-error=nonnull-compare -Wno-error=shift-negative-value -Wno-error=tautological-compare -Wno-error=unused-const-variable -Wno-error=bool-operation -Wno-error=deprecated -Wno-error=expansion-to-defined -Wno-error=format-overflow -Wno-error=format-truncation -Wno-error=implicit-fallthrough -Wno-error=int-in-bool-context -Wno-error=memset-elt-size -Wno-error=noexcept-type -Wno-error=nonnull -Wno-error=pointer-compare -Wno-error=stringop-overflow -Wno-error=aggressive-loop-optimizations -Wno-error=cast-function-type -Wno-error=catch-value -Wno-error=multistatement-macros -Wno-error=restrict -Wno-error=sizeof-pointer-memaccess -Wno-error=stringop-truncation -Wno-return-type -Wno-address-of-packed-member -c /workspace/src/contrib/netbsd-tests/lib/libc/string/t_swab.c -o t_swab.pieo
--- all_subdir_lib/libc/tests/sys ---
--- brk_test ---
--- brk_test.full ---
/usr/local/bin/x86_64-unknown-freebsd14.3-gcc13 --sysroot=/tmp/obj/workspace/src/amd64.amd64/tmp -B/usr/local/x86_64-unknown-freebsd14.3/bin/ -O2 -pipe -fno-common -fPIE -ffile-prefix-map=/workspace/src=/usr/src -ffile-prefix-map=/tmp/obj/workspace/src=/usr/obj -g -std=gnu17 -Wno-format-zero-length -fstack-protector-strong -Wsystem-headers -Werror -Wall -Wno-format-y2k -Wno-uninitialized -Wno-pointer-sign -Wdate-time -Wno-error=address -Wno-error=array-bounds -Wno-error=attributes -Wno-error=bool-compare -Wno-error=cast-align -Wno-error=clobbered -Wno-error=deprecated-declarations -Wno-error=enum-compare -Wno-error=extra -Wno-error=logical-not-parentheses -Wno-error=strict-aliasing -Wno-error=uninitialized -Wno-error=unused-function -Wno-error=unused-value -Wno-error=empty-body -Wno-error=maybe-uninitialized -Wno-error=nonnull-compare -Wno-error=shift-negative-value -Wno-error=tautological-compare -Wno-error=unused-const-variable -Wno-error=bool-operation -Wno-error=deprecated -Wno-error=expansion-to-defined -Wno-error=format-overflow -Wno-error=format-truncation -Wno-error=implicit-fallthrough -Wno-error=int-in-bool-context -Wno-error=memset-elt-size -Wno-error=noexcept-type -Wno-error=nonnull -Wno-error=pointer-compare -Wno-error=stringop-overflow -Wno-error=aggressive-loop-optimizations -Wno-error=cast-function-type -Wno-error=catch-value -Wno-error=multistatement-macros -Wno-error=restrict -Wno-error=sizeof-pointer-memaccess -Wno-error=stringop-truncation -Wno-return-type -Wno-address-of-packed-member -Wl,-zrelro -pie -Wl,-znoexecstack -o brk_test.full brk_test.pieo -lprivateatf-c
--- all_subdir_lib/libc/tests/string ---
--- swab_test.full ---
/usr/local/bin/x86_64-unknown-freebsd14.3-gcc13 --sysroot=/tmp/obj/workspace/src/amd64.amd64/tmp -B/usr/local/x86_64-unknown-freebsd14.3/bin/ -O2 -pipe -fno-common -fno-builtin -I/workspace/src/lib/libnetbsd -I/workspace/src/contrib/netbsd-tests -fPIE -ffile-prefix-map=/workspace/src=/usr/src -ffile-prefix-map=/tmp/obj/workspace/src=/usr/obj -g -std=gnu17 -Wno-format-zero-length -fstack-protector-strong -Wsystem-headers -Werror -Wall -Wno-format-y2k -Wno-uninitialized -Wno-pointer-sign -Wdate-time -Wno-error=address -Wno-error=array-bounds -Wno-error=attributes -Wno-error=bool-compare -Wno-error=cast-align -Wno-error=clobbered -Wno-error=deprecated-declarations -Wno-error=enum-compare -Wno-error=extra -Wno-error=logical-not-parentheses -Wno-error=strict-aliasing -Wno-error=uninitialized -Wno-error=unused-function -Wno-error=unused-value -Wno-error=empty-body -Wno-error=maybe-uninitialized -Wno-error=nonnull-compare -Wno-error=shift-negative-value -Wno-error=tautological-compare -Wno-error=unused-const-variable -Wno-error=bool-operation -Wno-error=deprecated -Wno-error=expansion-to-defined -Wno-error=format-overflow -Wno-error=format-truncation -Wno-error=implicit-fallthrough -Wno-error=int-in-bool-context -Wno-error=memset-elt-size -Wno-error=noexcept-type -Wno-error=nonnull -Wno-error=pointer-compare -Wno-error=stringop-overflow -Wno-error=aggressive-loop-optimizations -Wno-error=cast-function-type -Wno-error=catch-value -Wno-error=multistatement-macros -Wno-error=restrict -Wno-error=sizeof-pointer-memaccess -Wno-error=stringop-truncation -Wno-return-type -Wno-address-of-packed-member -L/tmp/obj/workspace/src/amd64.amd64/lib/libnetbsd -Wl,-zrelro -pie -Wl,-znoexecstack -o swab_test.full t_swab.pieo -lprivateatf-c -L/tmp/obj/workspace/src/amd64.amd64/lib/libnetbsd -lnetbsd_pie
--- all_subdir_lib/libc/tests/sys ---
--- brk_test.debug ---
/usr/local/x86_64-unknown-freebsd14.3/bin/objcopy --only-keep-debug brk_test.full brk_test.debug
--- brk_test ---
/usr/local/x86_64-unknown-freebsd14.3/bin/objcopy --strip-debug --add-gnu-debuglink=brk_test.debug brk_test.full brk_test
--- all_subdir_lib/libc/tests/termios ---
--- tcsetpgrp_test.full ---
/usr/local/bin/x86_64-unknown-freebsd14.3-gcc13 --sysroot=/tmp/obj/workspace/src/amd64.amd64/tmp -B/usr/local/x86_64-unknown-freebsd14.3/bin/ -O2 -pipe -fno-common -I/workspace/src/lib/libnetbsd -I/workspace/src/contrib/netbsd-tests -fPIE -ffile-prefix-map=/workspace/src=/usr/src -ffile-prefix-map=/tmp/obj/workspace/src=/usr/obj -g -std=gnu17 -Wno-format-zero-length -fstack-protector-strong -Wsystem-headers -Werror -Wall -Wno-format-y2k -Wno-uninitialized -Wno-pointer-sign -Wdate-time -Wno-error=address -Wno-error=array-bounds -Wno-error=attributes -Wno-error=bool-compare -Wno-error=cast-align -Wno-error=clobbered -Wno-error=deprecated-declarations -Wno-error=enum-compare -Wno-error=extra -Wno-error=logical-not-parentheses -Wno-error=strict-aliasing -Wno-error=uninitialized -Wno-error=unused-function -Wno-error=unused-value -Wno-error=empty-body -Wno-error=maybe-uninitialized -Wno-error=nonnull-compare -Wno-error=shift-negative-value -Wno-error=tautological-compare -Wno-error=unused-const-variable -Wno-error=bool-operation -Wno-error=deprecated -Wno-error=expansion-to-defined -Wno-error=format-overflow -Wno-error=format-truncation -Wno-error=implicit-fallthrough -Wno-error=int-in-bool-context -Wno-error=memset-elt-size -Wno-error=noexcept-type -Wno-error=nonnull -Wno-error=pointer-compare -Wno-error=stringop-overflow -Wno-error=aggressive-loop-optimizations -Wno-error=cast-function-type -Wno-error=catch-value -Wno-error=multistatement-macros -Wno-error=restrict -Wno-error=sizeof-pointer-memaccess -Wno-error=stringop-truncation -Wno-return-type -Wno-address-of-packed-member -L/tmp/obj/workspace/src/amd64.amd64/lib/libnetbsd -Wl,-zrelro -pie -Wl,-znoexecstack -o tcsetpgrp_test.full t_tcsetpgrp.pieo -lprivateatf-c -L/tmp/obj/workspace/src/amd64.amd64/lib/libnetbsd -lnetbsd_pie
--- all_subdir_tests ---
--- all_subdir_tests/sys/cam ---
===> tests/sys/cam (all)
--- all_subdir_lib ---
--- all_subdir_lib/libc/tests/string ---
--- swab_test.debug ---
/usr/local/x86_64-unknown-freebsd14.3/bin/objcopy --only-keep-debug swab_test.full swab_test.debug
--- swab_test ---
/usr/local/x86_64-unknown-freebsd14.3/bin/objcopy --strip-debug --add-gnu-debuglink=swab_test.debug swab_test.full swab_test
--- all_subdir_tests ---
--- all_subdir_tests/sys/cam/ctl ---
===> tests/sys/cam/ctl (all)
--- all_subdir_lib ---
--- Kyuafile ---
--- all_subdir_usr.sbin ---
--- all_subdir_usr.sbin/daemon ---
===> usr.sbin/daemon (all)
--- all_subdir_lib ---
--- all_subdir_lib/libc/tests/termios ---
--- tcsetpgrp_test.debug ---
--- all_subdir_tests ---
--- prout_register_huge_cdb ---
(cd /workspace/src/tests/sys/cam/ctl && DEPENDFILE=.depend.prout_register_huge_cdb NO_SUBDIR=1 make -f /workspace/src/tests/sys/cam/ctl/Makefile _RECURSING_PROGS=t PROG=prout_register_huge_cdb )
--- all_subdir_lib ---
/usr/local/x86_64-unknown-freebsd14.3/bin/objcopy --only-keep-debug tcsetpgrp_test.full tcsetpgrp_test.debug
--- tcsetpgrp_test ---
/usr/local/x86_64-unknown-freebsd14.3/bin/objcopy --strip-debug --add-gnu-debuglink=tcsetpgrp_test.debug tcsetpgrp_test.full tcsetpgrp_test
--- Kyuafile ---
--- all_subdir_tests ---
--- all_subdir_tests/sys/capsicum ---
===> tests/sys/capsicum (all)
--- all_subdir_usr.sbin ---
--- .depend ---
echo daemon.full: /tmp/obj/workspace/src/amd64.amd64/tmp/usr/lib/libc.a /tmp/obj/workspace/src/amd64.amd64/tmp/usr/lib/libutil.a >> .depend
--- daemon.pieo ---
/usr/local/bin/x86_64-unknown-freebsd14.3-gcc13 --sysroot=/tmp/obj/workspace/src/amd64.amd64/tmp -B/usr/local/x86_64-unknown-freebsd14.3/bin/ -fpie -DPIC -O2 -pipe -fno-common -fPIE -ffile-prefix-map=/workspace/src=/usr/src -ffile-prefix-map=/tmp/obj/workspace/src=/usr/obj -g -MD -MF.depend.daemon.pieo -MTdaemon.pieo -std=gnu17 -Wno-format-zero-length -fstack-protector-strong -Wsystem-headers -Werror -Wall -Wno-format-y2k -W -Wno-unused-parameter -Wmissing-prototypes -Wpointer-arith -Wreturn-type -Wcast-qual -Wwrite-strings -Wswitch -Wshadow -Wunused-parameter -Wcast-align -Wchar-subscripts -Wnested-externs -Wold-style-definition -Wno-pointer-sign -Wdate-time -Wno-error=address -Wno-error=array-bounds -Wno-error=attributes -Wno-error=bool-compare -Wno-error=cast-align -Wno-error=clobbered -Wno-error=deprecated-declarations -Wno-error=enum-compare -Wno-error=extra -Wno-error=logical-not-parentheses -Wno-error=strict-aliasing -Wno-error=uninitialized -Wno-error=unused-function -Wno-error=unused-value -Wno-error=empty-body -Wno-error=maybe-uninitialized -Wno-error=nonnull-compare -Wno-error=shift-negative-value -Wno-error=tautological-compare -Wno-error=unused-const-variable -Wno-error=bool-operation -Wno-error=deprecated -Wno-error=expansion-to-defined -Wno-error=format-overflow -Wno-error=format-truncation -Wno-error=implicit-fallthrough -Wno-error=int-in-bool-context -Wno-error=memset-elt-size -Wno-error=noexcept-type -Wno-error=nonnull -Wno-error=pointer-compare -Wno-error=stringop-overflow -Wno-error=aggressive-loop-optimizations -Wno-error=cast-function-type -Wno-error=catch-value -Wno-error=multistatement-macros -Wno-error=restrict -Wno-error=sizeof-pointer-memaccess -Wno-error=stringop-truncation -Wno-return-type -c /workspace/src/usr.sbin/daemon/daemon.c -o daemon.pieo
--- all_subdir_tests ---
--- all_subdir_tests/sys/cam ---
--- .depend.prout_register_huge_cdb ---
--- all_subdir_tests/sys/capsicum ---
--- mini-me.pieo ---
/usr/local/bin/x86_64-unknown-freebsd14.3-gcc13 --sysroot=/tmp/obj/workspace/src/amd64.amd64/tmp -B/usr/local/x86_64-unknown-freebsd14.3/bin/ -fpie -DPIC -O2 -pipe -fno-common -I/workspace/src/tests -fPIE -ffile-prefix-map=/workspace/src=/usr/src -ffile-prefix-map=/tmp/obj/workspace/src=/usr/obj -g -std=gnu17 -Wno-format-zero-length -fstack-protector-strong -Wsystem-headers -Werror -Wall -Wno-format-y2k -W -Wno-unused-parameter -Wmissing-prototypes -Wpointer-arith -Wreturn-type -Wcast-qual -Wwrite-strings -Wswitch -Wshadow -Wunused-parameter -Wcast-align -Wchar-subscripts -Wnested-externs -Wold-style-definition -Wno-pointer-sign -Wdate-time -Wno-error=address -Wno-error=array-bounds -Wno-error=attributes -Wno-error=bool-compare -Wno-error=cast-align -Wno-error=clobbered -Wno-error=deprecated-declarations -Wno-error=enum-compare -Wno-error=extra -Wno-error=logical-not-parentheses -Wno-error=strict-aliasing -Wno-error=uninitialized -Wno-error=unused-function -Wno-error=unused-value -Wno-error=empty-body -Wno-error=maybe-uninitialized -Wno-error=nonnull-compare -Wno-error=shift-negative-value -Wno-error=tautological-compare -Wno-error=unused-const-variable -Wno-error=bool-operation -Wno-error=deprecated -Wno-error=expansion-to-defined -Wno-error=format-overflow -Wno-error=format-truncation -Wno-error=implicit-fallthrough -Wno-error=int-in-bool-context -Wno-error=memset-elt-size -Wno-error=noexcept-type -Wno-error=nonnull -Wno-error=pointer-compare -Wno-error=stringop-overflow -Wno-error=aggressive-loop-optimizations -Wno-error=cast-function-type -Wno-error=catch-value -Wno-error=multistatement-macros -Wno-error=restrict -Wno-error=sizeof-pointer-memaccess -Wno-error=stringop-truncation -Wno-return-type -c /workspace/src/contrib/capsicum-test/mini-me.c -o mini-me.pieo
--- all_subdir_tests/sys/cam ---
echo prout_register_huge_cdb.full: /tmp/obj/workspace/src/amd64.amd64/tmp/usr/lib/libc.a /tmp/obj/workspace/src/amd64.amd64/tmp/usr/lib/libcam.a >> .depend.prout_register_huge_cdb
--- prout_register_huge_cdb.pieo ---
/usr/local/bin/x86_64-unknown-freebsd14.3-gcc13 --sysroot=/tmp/obj/workspace/src/amd64.amd64/tmp -B/usr/local/x86_64-unknown-freebsd14.3/bin/ -fpie -DPIC -O2 -pipe -fno-common -I/workspace/src/sys -fPIE -ffile-prefix-map=/workspace/src=/usr/src -ffile-prefix-map=/tmp/obj/workspace/src=/usr/obj -g -MD -MF.depend.prout_register_huge_cdb.prout_register_huge_cdb.pieo -MTprout_register_huge_cdb.pieo -std=gnu17 -Wno-format-zero-length -fstack-protector-strong -Wsystem-headers -Werror -Wall -Wno-format-y2k -W -Wno-unused-parameter -Wmissing-prototypes -Wpointer-arith -Wreturn-type -Wcast-qual -Wwrite-strings -Wswitch -Wshadow -Wunused-parameter -Wcast-align -Wchar-subscripts -Wnested-externs -Wold-style-definition -Wno-pointer-sign -Wdate-time -Wno-error=address -Wno-error=array-bounds -Wno-error=attributes -Wno-error=bool-compare -Wno-error=cast-align -Wno-error=clobbered -Wno-error=deprecated-declarations -Wno-error=enum-compare -Wno-error=extra -Wno-error=logical-not-parentheses -Wno-error=strict-aliasing -Wno-error=uninitialized -Wno-error=unused-function -Wno-error=unused-value -Wno-error=empty-body -Wno-error=maybe-uninitialized -Wno-error=nonnull-compare -Wno-error=shift-negative-value -Wno-error=tautological-compare -Wno-error=unused-const-variable -Wno-error=bool-operation -Wno-error=deprecated -Wno-error=expansion-to-defined -Wno-error=format-overflow -Wno-error=format-truncation -Wno-error=implicit-fallthrough -Wno-error=int-in-bool-context -Wno-error=memset-elt-size -Wno-error=noexcept-type -Wno-error=nonnull -Wno-error=pointer-compare -Wno-error=stringop-overflow -Wno-error=aggressive-loop-optimizations -Wno-error=cast-function-type -Wno-error=catch-value -Wno-error=multistatement-macros -Wno-error=restrict -Wno-error=sizeof-pointer-memaccess -Wno-error=stringop-truncation -Wno-return-type -c /workspace/src/tests/sys/cam/ctl/prout_register_huge_cdb.c -o prout_register_huge_cdb.pieo
--- all_subdir_tests/sys/capsicum ---
--- functional ---
echo '#! /usr/libexec/atf-sh' > functional.tmp
cat /workspace/src/tests/sys/capsicum/functional.sh >>functional.tmp
chmod +x functional.tmp
mv functional.tmp functional
--- Kyuafile ---
--- mini-me ---
(cd /workspace/src/tests/sys/capsicum && DEPENDFILE=.depend.mini-me NO_SUBDIR=1 make -f /workspace/src/tests/sys/capsicum/Makefile _RECURSING_PROGS=t PROG=mini-me )
--- .depend.mini-me ---
--- all_subdir_tests/sys/cam ---
--- Kyuafile ---
--- all_subdir_tests/sys/capsicum ---
echo mini-me.full: /tmp/obj/workspace/src/amd64.amd64/tmp/usr/lib/libc.a >> .depend.mini-me
--- mini-me.o ---
/usr/local/bin/x86_64-unknown-freebsd14.3-gcc13 --sysroot=/tmp/obj/workspace/src/amd64.amd64/tmp -B/usr/local/x86_64-unknown-freebsd14.3/bin/ -O2 -pipe -fno-common -I/workspace/src/tests -ffile-prefix-map=/workspace/src=/usr/src -ffile-prefix-map=/tmp/obj/workspace/src=/usr/obj -g -MD -MF.depend.mini-me.mini-me.o -MTmini-me.o -std=gnu17 -Wno-format-zero-length -fstack-protector-strong -Wsystem-headers -Werror -Wall -Wno-format-y2k -W -Wno-unused-parameter -Wmissing-prototypes -Wpointer-arith -Wreturn-type -Wcast-qual -Wwrite-strings -Wswitch -Wshadow -Wunused-parameter -Wcast-align -Wchar-subscripts -Wnested-externs -Wold-style-definition -Wno-pointer-sign -Wdate-time -Wno-error=address -Wno-error=array-bounds -Wno-error=attributes -Wno-error=bool-compare -Wno-error=cast-align -Wno-error=clobbered -Wno-error=deprecated-declarations -Wno-error=enum-compare -Wno-error=extra -Wno-error=logical-not-parentheses -Wno-error=strict-aliasing -Wno-error=uninitialized -Wno-error=unused-function -Wno-error=unused-value -Wno-error=empty-body -Wno-error=maybe-uninitialized -Wno-error=nonnull-compare -Wno-error=shift-negative-value -Wno-error=tautological-compare -Wno-error=unused-const-variable -Wno-error=bool-operation -Wno-error=deprecated -Wno-error=expansion-to-defined -Wno-error=format-overflow -Wno-error=format-truncation -Wno-error=implicit-fallthrough -Wno-error=int-in-bool-context -Wno-error=memset-elt-size -Wno-error=noexcept-type -Wno-error=nonnull -Wno-error=pointer-compare -Wno-error=stringop-overflow -Wno-error=aggressive-loop-optimizations -Wno-error=cast-function-type -Wno-error=catch-value -Wno-error=multistatement-macros -Wno-error=restrict -Wno-error=sizeof-pointer-memaccess -Wno-error=stringop-truncation -Wno-return-type -c /workspace/src/contrib/capsicum-test/mini-me.c -o mini-me.o
--- mini-me.noexec ---
(cd /workspace/src/tests/sys/capsicum && DEPENDFILE=.depend.mini-me.noexec NO_SUBDIR=1 make -f /workspace/src/tests/sys/capsicum/Makefile _RECURSING_PROGS=t PROG=mini-me.noexec )
--- .depend.mini-me.noexec ---
--- all_subdir_tests/sys/cam ---
--- all_subdir_tests/sys/cam/ctl ---
--- prout_register_huge_cdb.full ---
--- all_subdir_tests/sys/capsicum ---
echo mini-me.noexec.full: /tmp/obj/workspace/src/amd64.amd64/tmp/usr/lib/libc.a >> .depend.mini-me.noexec
--- mini-me.noexec.full ---
/usr/local/bin/x86_64-unknown-freebsd14.3-gcc13 --sysroot=/tmp/obj/workspace/src/amd64.amd64/tmp -B/usr/local/x86_64-unknown-freebsd14.3/bin/ -O2 -pipe -fno-common -I/workspace/src/tests -ffile-prefix-map=/workspace/src=/usr/src -ffile-prefix-map=/tmp/obj/workspace/src=/usr/obj -g -std=gnu17 -Wno-format-zero-length -fstack-protector-strong -Wsystem-headers -Werror -Wall -Wno-format-y2k -W -Wno-unused-parameter -Wmissing-prototypes -Wpointer-arith -Wreturn-type -Wcast-qual -Wwrite-strings -Wswitch -Wshadow -Wunused-parameter -Wcast-align -Wchar-subscripts -Wnested-externs -Wold-style-definition -Wno-pointer-sign -Wdate-time -Wno-error=address -Wno-error=array-bounds -Wno-error=attributes -Wno-error=bool-compare -Wno-error=cast-align -Wno-error=clobbered -Wno-error=deprecated-declarations -Wno-error=enum-compare -Wno-error=extra -Wno-error=logical-not-parentheses -Wno-error=strict-aliasing -Wno-error=uninitialized -Wno-error=unused-function -Wno-error=unused-value -Wno-error=empty-body -Wno-error=maybe-uninitialized -Wno-error=nonnull-compare -Wno-error=shift-negative-value -Wno-error=tautological-compare -Wno-error=unused-const-variable -Wno-error=bool-operation -Wno-error=deprecated -Wno-error=expansion-to-defined -Wno-error=format-overflow -Wno-error=format-truncation -Wno-error=implicit-fallthrough -Wno-error=int-in-bool-context -Wno-error=memset-elt-size -Wno-error=noexcept-type -Wno-error=nonnull -Wno-error=pointer-compare -Wno-error=stringop-overflow -Wno-error=aggressive-loop-optimizations -Wno-error=cast-function-type -Wno-error=catch-value -Wno-error=multistatement-macros -Wno-error=restrict -Wno-error=sizeof-pointer-memaccess -Wno-error=stringop-truncation -Wno-return-type -Wl,-zrelro -static -Wl,-znoexecstack -o mini-me.noexec.full mini-me.o
--- all_subdir_tests/sys/cam ---
/usr/local/bin/x86_64-unknown-freebsd14.3-gcc13 --sysroot=/tmp/obj/workspace/src/amd64.amd64/tmp -B/usr/local/x86_64-unknown-freebsd14.3/bin/ -O2 -pipe -fno-common -I/workspace/src/sys -fPIE -ffile-prefix-map=/workspace/src=/usr/src -ffile-prefix-map=/tmp/obj/workspace/src=/usr/obj -g -std=gnu17 -Wno-format-zero-length -fstack-protector-strong -Wsystem-headers -Werror -Wall -Wno-format-y2k -W -Wno-unused-parameter -Wmissing-prototypes -Wpointer-arith -Wreturn-type -Wcast-qual -Wwrite-strings -Wswitch -Wshadow -Wunused-parameter -Wcast-align -Wchar-subscripts -Wnested-externs -Wold-style-definition -Wno-pointer-sign -Wdate-time -Wno-error=address -Wno-error=array-bounds -Wno-error=attributes -Wno-error=bool-compare -Wno-error=cast-align -Wno-error=clobbered -Wno-error=deprecated-declarations -Wno-error=enum-compare -Wno-error=extra -Wno-error=logical-not-parentheses -Wno-error=strict-aliasing -Wno-error=uninitialized -Wno-error=unused-function -Wno-error=unused-value -Wno-error=empty-body -Wno-error=maybe-unin--- all_subdir_tests/sys/capsicum ---
--- mini-me ---
--- mini-me.full ---
--- all_subdir_tests/sys/cam ---
itialized -Wno-error=nonnull-compare -Wno-error=shift-negative-value -Wno-error=tautological-compare -Wno-error=unused-const-variable -Wno-error=bool-operation -Wno-error=deprecated -Wno-error=expansion-to-defined -Wno-error=format-overflow -Wno-error=format-truncation -Wno-error=implicit-fallthrough -Wno-error=int-in-bool-context -Wno-error=memset-elt-size -Wno-error=noexcept-type -Wno-error=nonnull -Wno-error=pointer-compare -Wno-error=stringop-overflow -Wno-error=aggressive-loop-optimizations -Wno-error=cast-function-type -Wno-error=catch-value -Wno-error=multistatement-macros -Wno-error=restrict -Wno-error=sizeof-pointer-memaccess -Wno-error=stringop-truncation -Wno-return-type -Wl,-zrelro -pie -Wl,-znoexecstack -o prout_register_huge_cdb.full prout_register_huge_cdb.pieo -lcam
--- prout_register_huge_cdb.debug ---
/usr/local/x86_64-unknown-freebsd14.3/bin/objcopy --only-keep-debug prout_register_huge_cdb.full prout_register_huge_cdb.debug
--- prout_register_huge_cdb ---
--- all_subdir_tests/sys/capsicum ---
/usr/local/bin/x86_64-unknown-freebsd14.3-gcc13 --sysroot=/tmp/obj/workspace/src/amd64.amd64/tmp -B/usr/local/x86_64-unknown-freebsd14.3/bin/ -O2 -pipe -fno-common -I/workspace/src/tests -ffile-prefix-map=/workspace/src=/usr/src -ffile-prefix-map=/tmp/obj/workspace/src=/usr/obj -g -std=gnu17 -Wno-format-zero-length -fstack-protector-strong -Wsystem-headers -Werror -Wall -Wno-format-y2k -W -Wno-unused-parameter -Wmissing-prototypes -Wpointer-arith -Wreturn-type -Wcast-qual -Wwrite-strings -Wswitch -Wshadow -Wunused-parameter -Wcast-align -Wchar-subscripts -Wnested-externs -Wold-style-definition -Wno-pointer-sign -Wdate-time -Wno-error=address -Wno-error=array-bounds -Wno-error=attributes -Wno-error=bool-compare -Wno-error=cast-align -Wno-error=clobbered -Wno-error=deprecated-declarations -Wno-error=enum-compare -Wno-error=extra -Wno-error=logical-not-parentheses -Wno-error=strict-aliasing -Wno-error=uninitialized -Wno-error=unused-function -Wno-error=unused-value -Wno-error=empty-body -Wno-error=maybe-uninitia--- all_subdir_tests/sys/cam ---
/usr/local/x86_64-unknown-freebsd14.3/bin/objcopy --strip-debug --add-gnu-debuglink=prout_register_huge_cdb.debug prout_register_huge_cdb.full prout_register_huge_cdb
--- persist ---
echo '#! /usr/libexec/atf-sh' > persist.tmp
cat /workspace/src/tests/sys/cam/ctl/persist.sh >>persist.tmp
chmod +x persist.tmp
mv persist.tmp persist
--- prevent ---
echo '#! /usr/libexec/atf-sh' > prevent.tmp
cat /workspace/src/tests/sys/cam/ctl/prevent.sh >>prevent.tmp
chmod +x prevent.tmp
mv prevent.tmp prevent
--- read_buffer ---
echo '#! /usr/libexec/atf-sh' > read_buffer.tmp
--- all_subdir_tests/sys/capsicum ---
lized -Wno-error=nonnull-compare -Wno-error=shift-negative-value -Wno-error=tautological-compare -Wno-error=unused-const-variable -Wno-error=bool-operation -Wno-error=deprecated -Wno-error=expansion-to-defined -Wno-error=format-overflow -Wno-error=format-truncation -Wno-error=implicit-fallthrough -Wno-error=int-in-bool-context -Wno-error=memset-elt-size -Wno-error=noexcept-type -Wno-error=nonnull -Wno-error=pointer-compare -Wno-error=stringop-overflow -Wno-error=aggressive-loop-optimizations -Wno-error=cast-function-type -Wno-error=catch-value -Wno-error=multistatement-macros -Wno-error=restrict -Wno-error=sizeof-pointer-memaccess -Wno-error=stringop-truncation -Wno-return-type -Wl,-zrelro -static -Wl,-znoexecstack -o mini-me.full mini-me.o
--- all_subdir_tests/sys/cam ---
cat /workspace/src/tests/sys/cam/ctl/read_buffer.sh >>read_buffer.tmp
chmod +x read_buffer.tmp
mv read_buffer.tmp read_buffer
--- start_stop_unit ---
echo '#! /usr/libexec/atf-sh' > start_stop_unit.tmp
cat /workspace/src/tests/sys/cam/ctl/start_stop_unit.sh >>start_stop_unit.tmp
chmod +x start_stop_unit.tmp
mv start_stop_unit.tmp start_stop_unit
--- Kyuafile ---
--- all_subdir_sbin ---
--- nat64lsn.pieo ---
/usr/local/bin/x86_64-unknown-freebsd14.3-gcc13 --sysroot=/tmp/obj/workspace/src/amd64.amd64/tmp -B/usr/local/x86_64-unknown-freebsd14.3/bin/ -fpie -DPIC -O2 -pipe -fno-common -DPF -fPIE -ffile-prefix-map=/workspace/src=/usr/src -ffile-prefix-map=/tmp/obj/workspace/src=/usr/obj -g -MD -MF.depend.nat64lsn.pieo -MTnat64lsn.pieo -std=gnu17 -Wno-format-zero-length -fstack-protector-strong -Wsystem-headers -Werror -Wall -Wno-format-y2k -W -Wno-unused-parameter -Wmissing-prototypes -Wpointer-arith -Wreturn-type -Wcast-qual -Wwrite-strings -Wswitch -Wshadow -Wunused-parameter -Wcast-align -Wchar-subscripts -Wnested-externs -Wold-style-definition -Wno-pointer-sign -Wdate-time -Wno-error=address -Wno-error=array-bounds -Wno-error=attributes -Wno-error=bool-compare -Wno-error=cast-align -Wno-error=clobbered -Wno-error=deprecated-declarations -Wno-error=enum-compare -Wno-error=extra -Wno-error=logical-not-parentheses -Wno-error=strict-aliasing -Wno-error=uninitialized -Wno-error=unused-function -Wno-error=unused-value -Wno-error=empty-body -Wno-error=maybe-uninitialized -Wno-error=nonnull-compare -Wno-error=shift-negative-value -Wno-error=tautological-compare -Wno-error=unused-const-variable -Wno-error=bool-operation -Wno-error=deprecated -Wno-error=expansion-to-defined -Wno-error=format-overflow -Wno-error=format-truncation -Wno-error=implicit-fallthrough -Wno-error=int-in-bool-context -Wno-error=memset-elt-size -Wno-error=noexcept-type -Wno-error=nonnull -Wno-error=pointer-compare -Wno-error=stringop-overflow -Wno-error=aggressive-loop-optimizations -Wno-error=cast-function-type -Wno-error=catch-value -Wno-error=multistatement-macros -Wno-error=restrict -Wno-error=sizeof-pointer-memaccess -Wno-error=stringop-truncation -Wno-return-type -Wno-cast-align -c /workspace/src/sbin/ipfw/nat64lsn.c -o nat64lsn.pieo
--- all_subdir_usr.bin ---
--- all_subdir_usr.bin/dtc ---
In function 'constexpr void std::__1::__uninitialized_allocator_relocate(_Alloc&, _Tp*, _Tp*, _Tp*) [with _Alloc = allocator<shared_ptr<dtc::fdt::property> >; _Tp = shared_ptr<dtc::fdt::property>]',
inlined from 'std::__1::vector<_Tp, _Alloc>::pointer std::__1::vector<_Tp, _Alloc>::__swap_out_circular_buffer(std::__1::__split_buffer<_Tp, _Allocator&>&, pointer) [with _Tp = std::__1::shared_ptr<dtc::fdt::property>; _Allocator = std::__1::allocator<std::__1::shared_ptr<dtc::fdt::property> >]' at /tmp/obj/workspace/src/amd64.amd64/tmp/usr/include/c++/v1/vector:1075:42,
inlined from 'std::__1::vector<_Tp, _Alloc>::iterator std::__1::vector<_Tp, _Alloc>::__insert_with_size(const_iterator, _Iterator, _Sentinel, difference_type) [with _Iterator = std::__1::__wrap_iter<const std::__1::shared_ptr<dtc::fdt::property>*>; _Sentinel = std::__1::__wrap_iter<const std::__1::shared_ptr<dtc::fdt::property>*>; _Tp = std::__1::shared_ptr<dtc::fdt::property>; _Allocator = std::__1::allocator<std::__1::shared_ptr<dtc::fdt::property> >]' at /tmp/obj/workspace/src/amd64.amd64/tmp/usr/include/c++/v1/vector:1786:39,
inlined from 'std::__1::vector<_Tp, _Alloc>::iterator std::__1::vector<_Tp, _Alloc>::insert(const_iterator, _ForwardIterator, _ForwardIterator) [with _ForwardIterator = std::__1::__wrap_iter<const std::__1::shared_ptr<dtc::fdt::property>*>; typename std::__1::enable_if<(std::__1::__has_iterator_category_convertible_to<_InputIterator, std::__1::forward_iterator_tag, std::__1::__has_iterator_category<std::__1::iterator_traits<_InIter> >::value>::value && std::__1::is_constructible<_Tp, typename std::__1::iterator_traits<_InIter>::reference>::value), int>::type <anonymous> = 0; _Tp = std::__1::shared_ptr<dtc::fdt::property>; _Allocator = std::__1::allocator<std::__1::shared_ptr<dtc::fdt::property> >]' at /tmp/obj/workspace/src/amd64.amd64/tmp/usr/include/c++/v1/vector:1755:28,
inlined from 'dtc::fdt::node::node(const std::__1::string&, const std::__1::vector<std::__1::shared_ptr<dtc::fdt::property> >&)' at /workspace/src/usr.bin/dtc/fdt.cc:858:14:
/tmp/obj/workspace/src/amd64.amd64/tmp/usr/include/c++/v1/__memory/uninitialized_algorithms.h:645:21: warning: argument 2 null where non-null expected [-Wnonnull]
645 | __builtin_memcpy(const_cast<__remove_const_t<_Tp>*>(__result), __first, sizeof(_Tp) * (__last - __first));
| ~~~~~~~~~~~~~~~~^~~~~~~~~~~~~~~~~~~~~~~~~~~~~~~~~~~~~~~~~~~~~~~~~~~~~~~~~~~~~~~~~~~~~~~~~~~~~~~~~~~~~~~~~
/tmp/obj/workspace/src/amd64.amd64/tmp/usr/include/c++/v1/__memory/uninitialized_algorithms.h:645:21: note: in a call to built-in function 'void* __builtin_memcpy(void*, const void*, long unsigned int)'
--- all_subdir_tests ---
--- all_subdir_tests/sys/capsicum ---
--- mini-me.noexec ---
/usr/local/bin/x86_64-unknown-freebsd14.3-ld: /tmp/obj/workspace/src/amd64.amd64/tmp/usr/lib/crt1.o: in function `_start':
/usr/src/lib/csu/amd64/crt1_s.S:66:(.text+0x17): undefined reference to `main'
--- all_subdir_usr.sbin ---
--- all_subdir_usr.sbin/daemon/tests ---
===> usr.sbin/daemon/tests (all)
--- daemon_test ---
echo '#! /usr/libexec/atf-sh' > daemon_test.tmp
cat /workspace/src/usr.sbin/daemon/tests/daemon_test.sh >>daemon_test.tmp
chmod +x daemon_test.tmp
mv daemon_test.tmp daemon_test
--- Kyuafile ---
--- daemon.full ---
/usr/local/bin/x86_64-unknown-freebsd14.3-gcc13 --sysroot=/tmp/obj/workspace/src/amd64.amd64/tmp -B/usr/local/x86_64-unknown-freebsd14.3/bin/ -O2 -pipe -fno-common -fPIE -ffile-prefix-map=/workspace/src=/usr/src -ffile-prefix-map=/tmp/obj/workspace/src=/usr/obj -g -std=gnu17 -Wno-format-zero-length -fstack-protector-strong -Wsystem-headers -Werror -Wall -Wno-format-y2k -W -Wno-unused-parameter -Wmissing-prototypes -Wpointer-arith -Wreturn-type -Wcast-qual -Wwrite-strings -Wswitch -Wshadow -Wunused-parameter -Wcast-align -Wchar-subscripts -Wnested-externs -Wold-style-definition -Wno-pointer-sign -Wdate-time -Wno-error=address -Wno-error=array-bounds -Wno-error=attributes -Wno-error=bool-compare -Wno-error=cast-align -Wno-error=clobbered -Wno-error=deprecated-declarations -Wno-error=enum-compare -Wno-error=extra -Wno-error=logical-not-parentheses -Wno-error=strict-aliasing -Wno-error=uninitialized -Wno-error=unused-function -Wno-error=unused-value -Wno-error=empty-body -Wno-error=maybe-uninitialized -Wno-error=nonnull-compare -Wno-error=shift-negative-value -Wno-error=tautological-compare -Wno-error=unused-const-variable -Wno-error=bool-operation -Wno-error=deprecated -Wno-error=expansion-to-defined -Wno-error=format-overflow -Wno-error=format-truncation -Wno-error=implicit-fallthrough -Wno-error=int-in-bool-context -Wno-error=memset-elt-size -Wno-error=noexcept-type -Wno-error=nonnull -Wno-error=pointer-compare -Wno-error=stringop-overflow -Wno-error=aggressive-loop-optimizations -Wno-error=cast-function-type -Wno-error=catch-value -Wno-error=multistatement-macros -Wno-error=restrict -Wno-error=sizeof-pointer-memaccess -Wno-error=stringop-truncation -Wno-return-type -Wl,-zrelro -pie -Wl,-znoexecstack -o daemon.full daemon.pieo -lutil
--- all_subdir_lib ---
--- all_subdir_lib/libc/tests/sys ---
--- cpuset_test ---
--- cpuset_test.full ---
/usr/local/bin/x86_64-unknown-freebsd14.3-gcc13 --sysroot=/tmp/obj/workspace/src/amd64.amd64/tmp -B/usr/local/x86_64-unknown-freebsd14.3/bin/ -O2 -pipe -fno-common -fPIE -ffile-prefix-map=/workspace/src=/usr/src -ffile-prefix-map=/tmp/obj/workspace/src=/usr/obj -g -std=gnu17 -Wno-format-zero-length -fstack-protector-strong -Wsystem-headers -Werror -Wall -Wno-format-y2k -Wno-uninitialized -Wno-pointer-sign -Wdate-time -Wno-error=address -Wno-error=array-bounds -Wno-error=attributes -Wno-error=bool-compare -Wno-error=cast-align -Wno-error=clobbered -Wno-error=deprecated-declarations -Wno-error=enum-compare -Wno-error=extra -Wno-error=logical-not-parentheses -Wno-error=strict-aliasing -Wno-error=uninitialized -Wno-error=unused-function -Wno-error=unused-value -Wno-error=empty-body -Wno-error=maybe-uninitialized -Wno-error=nonnull-compare -Wno-error=shift-negative-value -Wno-error=tautological-compare -Wno-error=unused-const-variable -Wno-error=bool-operation -Wno-error=deprecated -Wno-error=expansion-to-defined -Wno-error=format-overflow -Wno-error=format-truncation -Wno-error=implicit-fallthrough -Wno-error=int-in-bool-context -Wno-error=memset-elt-size -Wno-error=noexcept-type -Wno-error=nonnull -Wno-error=pointer-compare -Wno-error=stringop-overflow -Wno-error=aggressive-loop-optimizations -Wno-error=cast-function-type -Wno-error=catch-value -Wno-error=multistatement-macros -Wno-error=restrict -Wno-error=sizeof-pointer-memaccess -Wno-error=stringop-truncation -Wno-return-type -Wno-address-of-packed-member -Wl,-zrelro -pie -Wl,-znoexecstack -o cpuset_test.full cpuset_test.pieo -lprivateatf-c
--- all_subdir_usr.sbin ---
--- daemon.8.gz ---
gzip -cn /workspace/src/usr.sbin/daemon/daemon.8 > daemon.8.gz
--- daemon.debug ---
/usr/local/x86_64-unknown-freebsd14.3/bin/objcopy --only-keep-debug daemon.full daemon.debug
--- daemon ---
/usr/local/x86_64-unknown-freebsd14.3/bin/objcopy --strip-debug --add-gnu-debuglink=daemon.debug daemon.full daemon
--- all_subdir_lib ---
--- cpuset_test.debug ---
/usr/local/x86_64-unknown-freebsd14.3/bin/objcopy --only-keep-debug cpuset_test.full cpuset_test.debug
--- ctermid.3.gz ---
--- all_subdir_lib/libc/tests ---
--- cpuset_test ---
--- all_subdir_tests ---
collect2: error: ld returned 1 exit status
--- all_subdir_lib ---
--- ctermid.3.gz ---
gzip -cn /workspace/src/lib/libc/gen/ctermid.3 > ctermid.3.gz
--- all_subdir_rescue ---
*** [objs] Error code 6
make[4]: stopped in /workspace/src/rescue/rescue
1 error
make[4]: stopped in /workspace/src/rescue/rescue
177.86 real 854.74 user 100.83 sys
make[1]: stopped in /workspace/src
make: stopped in /workspace/src
Build step 'Execute shell' marked build as failure
[WARNINGS]Skipping publisher since build result is FAILURE
[PostBuildScript] - [INFO] Executing post build scripts.
[FreeBSD-stable-15-amd64-gcc13_build] $ /bin/sh -xe /tmp/jenkins16706227834078359904.sh
+ sh freebsd-ci/scripts/jail/clean.sh
clean jail FreeBSD-stable-15-amd64-gcc13_build
Checking for post-build
Performing post-build step
Checking if email needs to be generated
Email was triggered for: Failure - Any
Sending email for trigger: Failure - Any
Sending mail from default account using System Admin e-mail address