FreeBSD-stable-15-amd64-gcc13_build - Build #190 - Still Failing
Date: Thu, 06 Nov 2025 09:15:35 UTC
FreeBSD-stable-15-amd64-gcc13_build - Build #190 (ab0a1169ab6a9cad731c73dad95f0c9af86cdbe1) - Still Failing
Build information: https://ci.FreeBSD.org/job/FreeBSD-stable-15-amd64-gcc13_build/190/
Full change log: https://ci.FreeBSD.org/job/FreeBSD-stable-15-amd64-gcc13_build/190/changes
Full build log: https://ci.FreeBSD.org/job/FreeBSD-stable-15-amd64-gcc13_build/190/console
Status explanation:
"Failure" - the build is suspected being broken by the following changes
"Still Failing" - the build has not been fixed by the following changes and
this is a notification to note that these changes have
not been fully tested by the CI system
Change summaries:
(Those commits are likely but not certainly responsible)
ab0a1169ab6a9cad731c73dad95f0c9af86cdbe1 by delphij:
cron: Use reallocarray() to prevent integer overflow
The end of the build log:
[...truncated 99.83 MiB...]
--- all_subdir_rescue ---
--- .depend ---
echo bectl.full: /tmp/obj/workspace/src/amd64.amd64/tmp/usr/lib/libc.a /tmp/obj/workspace/src/amd64.amd64/rescue/rescue/workspace/src/lib/libbe/libbe.a /tmp/obj/workspace/src/amd64.amd64/rescue/rescue/workspace/src/cddl/lib/libzfs/libzfs.a /tmp/obj/workspace/src/amd64.amd64/tmp/usr/lib/libmd.a /tmp/obj/workspace/src/amd64.amd64/tmp/usr/lib/libpthread.a /tmp/obj/workspace/src/amd64.amd64/tmp/usr/lib/libc.a /tmp/obj/workspace/src/amd64.amd64/tmp/usr/lib/libcompiler_rt.a /tmp/obj/workspace/src/amd64.amd64/rescue/rescue/workspace/src/lib/libsys/libsys.a /tmp/obj/workspace/src/amd64.amd64/tmp/usr/lib/libcompiler_rt.a /tmp/obj/workspace/src/amd64.amd64/rescue/rescue/workspace/src/lib/libsys/libsys.a /tmp/obj/workspace/src/amd64.amd64/tmp/usr/lib/libcompiler_rt.a /tmp/obj/workspace/src/amd64.amd64/tmp/usr/lib/librt.a /tmp/obj/workspace/src/amd64.amd64/tmp/usr/lib/libpthread.a /tmp/obj/workspace/src/amd64.amd64/tmp/usr/lib/libc.a /tmp/obj/workspace/src/amd64.amd64/tmp/usr/lib/libcompiler_rt.a /tmp/obj/workspace/src/amd64.amd64/rescue/rescue/workspace/src/lib/libsys/libsys.a /tmp/obj/workspace/src/amd64.amd64/tmp/usr/lib/libcompiler_rt.a /tmp/obj/workspace/src/amd64.amd64/rescue/rescue/workspace/src/lib/libsys/libsys.a /tmp/obj/workspace/src/amd64.amd64/tmp/usr/lib/libcompiler_rt.a /tmp/obj/workspace/src/amd64.amd64/tmp/usr/lib/libumem.a /tmp/obj/workspace/src/amd64.amd64/tmp/usr/lib/libutil.a /tmp/obj/workspace/src/amd64.amd64/tmp/usr/lib/libuutil.a /tmp/obj/workspace/src/amd64.amd64/tmp/usr/lib/libavl.a /tmp/obj/workspace/src/amd64.amd64/tmp/usr/lib/libspl.a /tmp/obj/workspace/src/amd64.amd64/tmp/usr/lib/libspl.a /tmp/obj/workspace/src/amd64.amd64/tmp/usr/lib/libm.a /tmp/obj/workspace/src/amd64.amd64/tmp/usr/lib/libavl.a /tmp/obj/workspace/src/amd64.amd64/tmp/usr/lib/libspl.a /tmp/obj/workspace/src/amd64.amd64/tmp/usr/lib/libbsdxml.a /tmp/obj/workspace/src/amd64.amd64/tmp/usr/lib/libcrypto.a /tmp/obj/workspace/src/amd64.amd64/tmp/usr/lib/libpthread.a /tmp/obj/workspace/src/amd64.amd64/tmp/usr/lib/libc.a /tmp/obj/workspace/src/amd64.amd64/tmp/usr/lib/libcompiler_rt.a /tmp/obj/workspace/src/amd64.amd64/rescue/rescue/workspace/src/lib/libsys/libsys.a /tmp/obj/workspace/src/amd64.amd64/tmp/usr/lib/libcompiler_rt.a /tmp/obj/workspace/src/amd64.amd64/rescue/rescue/workspace/src/lib/libsys/libsys.a /tmp/obj/workspace/src/amd64.amd64/tmp/usr/lib/libcompiler_rt.a /tmp/obj/workspace/src/amd64.amd64/tmp/usr/lib/libgeom.a /tmp/obj/workspace/src/amd64.amd64/tmp/usr/lib/libbsdxml.a /tmp/obj/workspace/src/amd64.amd64/tmp/usr/lib/libsbuf.a /tmp/obj/workspace/src/amd64.amd64/rescue/rescue/workspace/src/cddl/lib/libnvpair/libnvpair.a /tmp/obj/workspace/src/amd64.amd64/tmp/usr/lib/libspl.a /tmp/obj/workspace/src/amd64.amd64/tmp/usr/lib/libz.a /tmp/obj/workspace/src/amd64.amd64/rescue/rescue/workspace/src/cddl/lib/libzfs_core/libzfs_core.a /tmp/obj/workspace/src/amd64.amd64/rescue/rescue/workspace/src/cddl/lib/libnvpair/libnvpair.a /tmp/obj/workspace/src/amd64.amd64/tmp/usr/lib/libspl.a /tmp/obj/workspace/src/amd64.amd64/tmp/usr/lib/libspl.a /tmp/obj/workspace/src/amd64.amd64/rescue/rescue/workspace/src/cddl/lib/libzutil/libzutil.a /tmp/obj/workspace/src/amd64.amd64/tmp/usr/lib/libavl.a /tmp/obj/workspace/src/amd64.amd64/tmp/usr/lib/libspl.a /tmp/obj/workspace/src/amd64.amd64/tmp/usr/lib/libgeom.a /tmp/obj/workspace/src/amd64.amd64/tmp/usr/lib/libbsdxml.a /tmp/obj/workspace/src/amd64.amd64/tmp/usr/lib/libsbuf.a /tmp/obj/workspace/src/amd64.amd64/tmp/usr/lib/libm.a /tmp/obj/workspace/src/amd64.amd64/tmp/usr/lib/libtpool.a /tmp/obj/workspace/src/amd64.amd64/tmp/usr/lib/libspl.a /tmp/obj/workspace/src/amd64.amd64/rescue/rescue/workspace/src/cddl/lib/libzutil/libzutil.a /tmp/obj/workspace/src/amd64.amd64/tmp/usr/lib/libavl.a /tmp/obj/workspace/src/amd64.amd64/tmp/usr/lib/libspl.a /tmp/obj/workspace/src/amd64.amd64/tmp/usr/lib/libgeom.a /tmp/obj/workspace/src/amd64.amd64/tmp/usr/lib/libbsdxml.a /tmp/obj/workspace/src/amd64.amd64/tmp/usr/lib/libsbuf.a /tmp/obj/workspace/src/amd64.amd64/tmp/usr/lib/libm.a /tmp/obj/workspace/src/amd64.amd64/tmp/usr/lib/libtpool.a /tmp/obj/workspace/src/amd64.amd64/tmp/usr/lib/libspl.a /tmp/obj/workspace/src/amd64.amd64/tmp/usr/lib/libspl.a /tmp/obj/workspace/src/amd64.amd64/rescue/rescue/workspace/src/cddl/lib/libnvpair/libnvpair.a /tmp/obj/workspace/src/amd64.amd64/tmp/usr/lib/libspl.a /tmp/obj/workspace/src/amd64.amd64/rescue/rescue/workspace/src/cddl/lib/libzfsbootenv/libzfsbootenv.a /tmp/obj/workspace/src/amd64.amd64/rescue/rescue/workspace/src/cddl/lib/libzfs/libzfs.a /tmp/obj/workspace/src/amd64.amd64/tmp/usr/lib/libmd.a /tmp/obj/workspace/src/amd64.amd64/tmp/usr/lib/libpthread.a /tmp/obj/workspace/src/amd64.amd64/tmp/usr/lib/libc.a /tmp/obj/workspace/src/amd64.amd64/tmp/usr/lib/libcompiler_rt.a /tmp/obj/workspace/src/amd64.amd64/rescue/rescue/workspace/src/lib/libsys/libsys.a /tmp/obj/workspace/src/amd64.amd64/tmp/usr/lib/libcompiler_rt.a /tmp/obj/workspace/src/amd64.amd64/rescue/rescue/workspace/src/lib/libsys/libsys.a /tmp/obj/workspace/src/amd64.amd64/tmp/usr/lib/libcompiler_rt.a /tmp/obj/workspace/src/amd64.amd64/tmp/usr/lib/librt.a /tmp/obj/workspace/src/amd64.amd64/tmp/usr/lib/libpthread.a /tmp/obj/workspace/src/amd64.amd64/tmp/usr/lib/libc.a /tmp/obj/workspace/src/amd64.amd64/tmp/usr/lib/libcompiler_rt.a /tmp/obj/workspace/src/amd64.amd64/rescue/rescue/workspace/src/lib/libsys/libsys.a /tmp/obj/workspace/src/amd64.amd64/tmp/usr/lib/libcompiler_rt.a /tmp/obj/workspace/src/amd64.amd64/rescue/rescue/workspace/src/lib/libsys/libsys.a /tmp/obj/workspace/src/amd64.amd64/tmp/usr/lib/libcompiler_rt.a /tmp/obj/workspace/src/amd64.amd64/tmp/usr/lib/libumem.a /tmp/obj/workspace/src/amd64.amd64/tmp/usr/lib/libutil.a /tmp/obj/workspace/src/amd64.amd64/tmp/usr/lib/libuutil.a /tmp/obj/workspace/src/amd64.amd64/tmp/usr/lib/libavl.a /tmp/obj/workspace/src/amd64.amd64/tmp/usr/lib/libspl.a /tmp/obj/workspace/src/amd64.amd64/tmp/usr/lib/libspl.a /tmp/obj/workspace/src/amd64.amd64/tmp/usr/lib/libm.a /tmp/obj/workspace/src/amd64.amd64/tmp/usr/lib/libavl.a /tmp/obj/workspace/src/amd64.amd64/tmp/usr/lib/libspl.a /tmp/obj/workspace/src/amd64.amd64/tmp/usr/lib/libbsdxml.a /tmp/obj/workspace/src/amd64.amd64/tmp/usr/lib/libcrypto.a /tmp/obj/workspace/src/amd64.amd64/tmp/usr/lib/libpthread.a /tmp/obj/workspace/src/amd64.amd64/tmp/usr/lib/libc.a /tmp/obj/workspace/src/amd64.amd64/tmp/usr/lib/libcompiler_rt.a /tmp/obj/workspace/src/amd64.amd64/rescue/rescue/workspace/src/lib/libsys/libsys.a /tmp/obj/workspace/src/amd64.amd64/tmp/usr/lib/libcompiler_rt.a /tmp/obj/workspace/src/amd64.amd64/rescue/rescue/workspace/src/lib/libsys/libsys.a /tmp/obj/workspace/src/amd64.amd64/tmp/usr/lib/libcompiler_rt.a /tmp/obj/workspace/src/amd64.amd64/tmp/usr/lib/libgeom.a /tmp/obj/workspace/src/amd64.amd64/tmp/usr/lib/libbsdxml.a /tmp/obj/workspace/src/amd64.amd64/tmp/usr/lib/libsbuf.a /tmp/obj/workspace/src/amd64.amd64/rescue/rescue/workspace/src/cddl/lib/libnvpair/libnvpair.a /tmp/obj/workspace/src/amd64.amd64/tmp/usr/lib/libspl.a /tmp/obj/workspace/src/amd64.amd64/tmp/usr/lib/libz.a /tmp/obj/workspace/src/amd64.amd64/rescue/rescue/workspace/src/cddl/lib/libzfs_core/libzfs_core.a /tmp/obj/workspace/src/amd64.amd64/rescue/rescue/workspace/src/cddl/lib/libnvpair/libnvpair.a /tmp/obj/workspace/src/amd64.amd64/tmp/usr/lib/libspl.a /tmp/obj/workspace/src/amd64.amd64/tmp/usr/lib/libspl.a /tmp/obj/workspace/src/amd64.amd64/rescue/rescue/workspace/src/cddl/lib/libzutil/libzutil.a /tmp/obj/workspace/src/amd64.amd64/tmp/usr/lib/libavl.a /tmp/obj/workspace/src/amd64.amd64/tmp/usr/lib/libspl.a /tmp/obj/workspace/src/amd64.amd64/tmp/usr/lib/libgeom.a /tmp/obj/workspace/src/amd64.amd64/tmp/usr/lib/libbsdxml.a /tmp/obj/workspace/src/amd64.amd64/tmp/usr/lib/libsbuf.a /tmp/obj/workspace/src/amd64.amd64/tmp/usr/lib/libm.a /tmp/obj/workspace/src/amd64.amd64/tmp/usr/lib/libtpool.a /tmp/obj/workspace/src/amd64.amd64/tmp/usr/lib/libspl.a /tmp/obj/workspace/src/amd64.amd64/rescue/rescue/workspace/src/cddl/lib/libzutil/libzutil.a /tmp/obj/workspace/src/amd64.amd64/tmp/usr/lib/libavl.a /tmp/obj/workspace/src/amd64.amd64/tmp/usr/lib/libspl.a /tmp/obj/workspace/src/amd64.amd64/tmp/usr/lib/libgeom.a /tmp/obj/workspace/src/amd64.amd64/tmp/usr/lib/libbsdxml.a /tmp/obj/workspace/src/amd64.amd64/tmp/usr/lib/libsbuf.a /tmp/obj/workspace/src/amd64.amd64/tmp/usr/lib/libm.a /tmp/obj/workspace/src/amd64.amd64/tmp/usr/lib/libtpool.a /tmp/obj/workspace/src/amd64.amd64/tmp/usr/lib/libspl.a /tmp/obj/workspace/src/amd64.amd64/rescue/rescue/workspace/src/cddl/lib/libnvpair/libnvpair.a /tmp/obj/workspace/src/amd64.amd64/tmp/usr/lib/libspl.a /tmp/obj/workspace/src/amd64.amd64/tmp/usr/lib/libjail.a /tmp/obj/workspace/src/amd64.amd64/rescue/rescue/workspace/src/cddl/lib/libnvpair/libnvpair.a /tmp/obj/workspace/src/amd64.amd64/tmp/usr/lib/libspl.a /tmp/obj/workspace/src/amd64.amd64/tmp/usr/lib/libspl.a /tmp/obj/workspace/src/amd64.amd64/tmp/usr/lib/libutil.a /tmp/obj/workspace/src/amd64.amd64/rescue/rescue/workspace/src/cddl/lib/libzfsbootenv/libzfsbootenv.a /tmp/obj/workspace/src/amd64.amd64/rescue/rescue/workspace/src/cddl/lib/libzfs/libzfs.a /tmp/obj/workspace/src/amd64.amd64/tmp/usr/lib/libmd.a /tmp/obj/workspace/src/amd64.amd64/tmp/usr/lib/libpthread.a /tmp/obj/workspace/src/amd64.amd64/tmp/usr/lib/libc.a /tmp/obj/workspace/src/amd64.amd64/tmp/usr/lib/libcompiler_rt.a /tmp/obj/workspace/src/amd64.amd64/rescue/rescue/workspace/src/lib/libsys/libsys.a /tmp/obj/workspace/src/amd64.amd64/tmp/usr/lib/libcompiler_rt.a /tmp/obj/workspace/src/amd64.amd64/rescue/rescue/workspace/src/lib/libsys/libsys.a /tmp/obj/workspace/src/amd64.amd64/tmp/usr/lib/libcompiler_rt.a /tmp/obj/workspace/src/amd64.amd64/tmp/usr/lib/librt.a /tmp/obj/workspace/src/amd64.amd64/tmp/usr/lib/libpthread.a /tmp/obj/workspace/src/amd64.amd64/tmp/usr/lib/libc.a /tmp/obj/workspace/src/amd64.amd64/tmp/usr/lib/libcompiler_rt.a /tmp/obj/workspace/src/amd64.amd64/rescue/rescue/workspace/src/lib/libsys/libsys.a /tmp/obj/workspace/src/amd64.amd64/tmp/usr/lib/libcompiler_rt.a /tmp/obj/workspace/src/amd64.amd64/rescue/rescue/workspace/src/lib/libsys/libsys.a /tmp/obj/workspace/src/amd64.amd64/tmp/usr/lib/libcompiler_rt.a /tmp/obj/workspace/src/amd64.amd64/tmp/usr/lib/libumem.a /tmp/obj/workspace/src/amd64.amd64/tmp/usr/lib/libutil.a /tmp/obj/workspace/src/amd64.amd64/tmp/usr/lib/libuutil.a /tmp/obj/workspace/src/amd64.amd64/tmp/usr/lib/libavl.a /tmp/obj/workspace/src/amd64.amd64/tmp/usr/lib/libspl.a /tmp/obj/workspace/src/amd64.amd64/tmp/usr/lib/libspl.a /tmp/obj/workspace/src/amd64.amd64/tmp/usr/lib/libm.a /tmp/obj/workspace/src/amd64.amd64/tmp/usr/lib/libavl.a /tmp/obj/workspace/src/amd64.amd64/tmp/usr/lib/libspl.a /tmp/obj/workspace/src/amd64.amd64/tmp/usr/lib/libbsdxml.a /tmp/obj/workspace/src/amd64.amd64/tmp/usr/lib/libcrypto.a /tmp/obj/workspace/src/amd64.amd64/tmp/usr/lib/libpthread.a /tmp/obj/workspace/src/amd64.amd64/tmp/usr/lib/libc.a /tmp/obj/workspace/src/amd64.amd64/tmp/usr/lib/libcompiler_rt.a /tmp/obj/workspace/src/amd64.amd64/rescue/rescue/workspace/src/lib/libsys/libsys.a /tmp/obj/workspace/src/amd64.amd64/tmp/usr/lib/libcompiler_rt.a /tmp/obj/workspace/src/amd64.amd64/rescue/rescue/workspace/src/lib/libsys/libsys.a /tmp/obj/workspace/src/amd64.amd64/tmp/usr/lib/libcompiler_rt.a /tmp/obj/workspace/src/amd64.amd64/tmp/usr/lib/libgeom.a /tmp/obj/workspace/src/amd64.amd64/tmp/usr/lib/libbsdxml.a /tmp/obj/workspace/src/amd64.amd64/tmp/usr/lib/libsbuf.a /tmp/obj/workspace/src/amd64.amd64/rescue/rescue/workspace/src/cddl/lib/libnvpair/libnvpair.a /tmp/obj/workspace/src/amd64.amd64/tmp/usr/lib/libspl.a /tmp/obj/workspace/src/amd64.amd64/tmp/usr/lib/libz.a /tmp/obj/workspace/src/amd64.amd64/rescue/rescue/workspace/src/cddl/lib/libzfs_core/libzfs_core.a /tmp/obj/workspace/src/amd64.amd64/rescue/rescue/workspace/src/cddl/lib/libnvpair/libnvpair.a /tmp/obj/workspace/src/amd64.amd64/tmp/usr/lib/libspl.a /tmp/obj/workspace/src/amd64.amd64/tmp/usr/lib/libspl.a /tmp/obj/workspace/src/amd64.amd64/rescue/rescue/workspace/src/cddl/lib/libzutil/libzutil.a /tmp/obj/workspace/src/amd64.amd64/tmp/usr/lib/libavl.a /tmp/obj/workspace/src/amd64.amd64/tmp/usr/lib/libspl.a /tmp/obj/workspace/src/amd64.amd64/tmp/usr/lib/libgeom.a /tmp/obj/workspace/src/amd64.amd64/tmp/usr/lib/libbsdxml.a /tmp/obj/workspace/src/amd64.amd64/tmp/usr/lib/libsbuf.a /tmp/obj/workspace/src/amd64.amd64/tmp/usr/lib/libm.a /tmp/obj/workspace/src/amd64.amd64/tmp/usr/lib/libtpool.a /tmp/obj/workspace/src/amd64.amd64/tmp/usr/lib/libspl.a /tmp/obj/workspace/src/amd64.amd64/rescue/rescue/workspace/src/cddl/lib/libzutil/libzutil.a /tmp/obj/workspace/src/amd64.amd64/tmp/usr/lib/libavl.a /tmp/obj/workspace/src/amd64.amd64/tmp/usr/lib/libspl.a /tmp/obj/workspace/src/amd64.amd64/tmp/usr/lib/libgeom.a /tmp/obj/workspace/src/amd64.amd64/tmp/usr/lib/libbsdxml.a /tmp/obj/workspace/src/amd64.amd64/tmp/usr/lib/libsbuf.a /tmp/obj/workspace/src/amd64.amd64/tmp/usr/lib/libm.a /tmp/obj/workspace/src/amd64.amd64/tmp/usr/lib/libtpool.a /tmp/obj/workspace/src/amd64.amd64/tmp/usr/lib/libspl.a /tmp/obj/workspace/src/amd64.amd64/rescue/rescue/workspace/src/cddl/lib/libnvpair/libnvpair.a /tmp/obj/workspace/src/amd64.amd64/tmp/usr/lib/libspl.a >> .depend
--- bectl.o ---
/usr/local/bin/x86_64-unknown-freebsd14.3-gcc13 --sysroot=/tmp/obj/workspace/src/amd64.amd64/tmp -B/usr/local/x86_64-unknown-freebsd14.3/bin/ -O2 -pipe -fno-common -DIN_BASE -I/workspace/src/sys/contrib/openzfs/include -I/workspace/src/sys/contrib/openzfs/lib/libspl/include/ -I/workspace/src/sys/contrib/openzfs/lib/libspl/include/os/freebsd -I/workspace/src/sys -I/workspace/src/cddl/compat/opensolaris/include -I/workspace/src/sys/contrib/openzfs/module/icp/include -include /workspace/src/sys/contrib/openzfs/include/os/freebsd/spl/sys/ccompile.h -DHAVE_ISSETUGID -DHAVE_STRLCAT -DHAVE_STRLCPY -include /workspace/src/sys/modules/zfs/zfs_config.h -DRESCUE -I/tmp/obj/workspace/src/amd64.amd64/lib/libifconfig -I/tmp/obj/workspace/src/amd64.amd64/lib/libiscsiutil -ffile-prefix-map=/workspace/src=/usr/src -ffile-prefix-map=/tmp/obj/workspace/src/amd64.amd64/rescue/rescue/workspace/src=/usr/obj -g -MD -MF.depend.bectl.o -MTbectl.o -std=gnu17 -Wno-format-zero-length -fstack-protector-strong -Wsystem-headers -Werror -Wall -Wno-format-y2k -W -Wno-unused-parameter -Wmissing-prototypes -Wpointer-arith -Wreturn-type -Wcast-qual -Wwrite-strings -Wswitch -Wshadow -Wunused-parameter -Wcast-align -Wchar-subscripts -Wnested-externs -Wold-style-definition -Wno-pointer-sign -Wdate-time -Wno-error=address -Wno-error=array-bounds -Wno-error=attributes -Wno-error=bool-compare -Wno-error=cast-align -Wno-error=clobbered -Wno-error=deprecated-declarations -Wno-error=enum-compare -Wno-error=extra -Wno-error=logical-not-parentheses -Wno-error=strict-aliasing -Wno-error=uninitialized -Wno-error=unused-function -Wno-error=unused-value -Wno-error=empty-body -Wno-error=maybe-uninitialized -Wno-error=nonnull-compare -Wno-error=shift-negative-value -Wno-error=tautological-compare -Wno-error=unused-const-variable -Wno-error=bool-operation -Wno-error=deprecated -Wno-error=expansion-to-defined -Wno-error=format-overflow -Wno-error=format-truncation -Wno-error=implicit-fallthrough -Wno-error=int-in-bool-context -Wno-error=memset-elt-size -Wno-error=noexcept-type -Wno-error=nonnull -Wno-error=pointer-compare -Wno-error=stringop-overflow -Wno-error=aggressive-loop-optimizations -Wno-error=cast-function-type -Wno-error=catch-value -Wno-error=multistatement-macros -Wno-error=restrict -Wno-error=sizeof-pointer-memaccess -Wno-error=stringop-truncation -Wno-return-type -c /workspace/src/sbin/bectl/bectl.c -o bectl.o
--- all_subdir_tests ---
--- administrative.debug ---
/usr/local/x86_64-unknown-freebsd14.3/bin/objcopy --only-keep-debug administrative.full administrative.debug
--- administrative ---
/usr/local/x86_64-unknown-freebsd14.3/bin/objcopy --strip-debug --add-gnu-debuglink=administrative.debug administrative.full administrative
--- miscellaneous ---
(cd /workspace/src/tests/sys/audit && DEPENDFILE=.depend.miscellaneous NO_SUBDIR=1 make -f /workspace/src/tests/sys/audit/Makefile _RECURSING_PROGS=t PROG=miscellaneous )
--- .depend.miscellaneous ---
echo miscellaneous.full: /tmp/obj/workspace/src/amd64.amd64/tmp/usr/lib/libc.a /tmp/obj/workspace/src/amd64.amd64/tmp/usr/lib/libprivateatf-c.a >> .depend.miscellaneous
--- miscellaneous.o ---
/usr/local/bin/x86_64-unknown-freebsd14.3-gcc13 --sysroot=/tmp/obj/workspace/src/amd64.amd64/tmp -B/usr/local/x86_64-unknown-freebsd14.3/bin/ -O2 -pipe -fno-common -I/workspace/src/contrib/openbsm -ffile-prefix-map=/workspace/src=/usr/src -ffile-prefix-map=/tmp/obj/workspace/src=/usr/obj -g -MD -MF.depend.miscellaneous.miscellaneous.o -MTmiscellaneous.o -std=gnu17 -Wno-format-zero-length -fstack-protector-strong -Wsystem-headers -Werror -Wall -Wno-format-y2k -W -Wno-unused-parameter -Wmissing-prototypes -Wpointer-arith -Wreturn-type -Wcast-qual -Wwrite-strings -Wswitch -Wshadow -Wunused-parameter -Wcast-align -Wchar-subscripts -Wnested-externs -Wold-style-definition -Wno-pointer-sign -Wdate-time -Wno-error=address -Wno-error=array-bounds -Wno-error=attributes -Wno-error=bool-compare -Wno-error=cast-align -Wno-error=clobbered -Wno-error=deprecated-declarations -Wno-error=enum-compare -Wno-error=extra -Wno-error=logical-not-parentheses -Wno-error=strict-aliasing -Wno-error=uninitialized -Wno-error=unused-function -Wno-error=unused-value -Wno-error=empty-body -Wno-error=maybe-uninitialized -Wno-error=nonnull-compare -Wno-error=shift-negative-value -Wno-error=tautological-compare -Wno-error=unused-const-variable -Wno-error=bool-operation -Wno-error=deprecated -Wno-error=expansion-to-defined -Wno-error=format-overflow -Wno-error=format-truncation -Wno-error=implicit-fallthrough -Wno-error=int-in-bool-context -Wno-error=memset-elt-size -Wno-error=noexcept-type -Wno-error=nonnull -Wno-error=pointer-compare -Wno-error=stringop-overflow -Wno-error=aggressive-loop-optimizations -Wno-error=cast-function-type -Wno-error=catch-value -Wno-error=multistatement-macros -Wno-error=restrict -Wno-error=sizeof-pointer-memaccess -Wno-error=stringop-truncation -Wno-return-type -c /workspace/src/tests/sys/audit/miscellaneous.c -o miscellaneous.o
--- all_subdir_usr.bin ---
--- all_subdir_usr.bin/expand ---
===> usr.bin/expand (all)
--- .depend ---
echo expand.full: /tmp/obj/workspace/src/amd64.amd64/tmp/usr/lib/libc.a >> .depend
--- expand.pieo ---
/usr/local/bin/x86_64-unknown-freebsd14.3-gcc13 --sysroot=/tmp/obj/workspace/src/amd64.amd64/tmp -B/usr/local/x86_64-unknown-freebsd14.3/bin/ -fpie -DPIC -O2 -pipe -fno-common -fPIE -ffile-prefix-map=/workspace/src=/usr/src -ffile-prefix-map=/tmp/obj/workspace/src=/usr/obj -g -MD -MF.depend.expand.pieo -MTexpand.pieo -std=gnu17 -Wno-format-zero-length -fstack-protector-strong -Wsystem-headers -Werror -Wall -Wno-format-y2k -W -Wno-unused-parameter -Wmissing-prototypes -Wpointer-arith -Wreturn-type -Wcast-qual -Wwrite-strings -Wswitch -Wshadow -Wunused-parameter -Wcast-align -Wchar-subscripts -Wnested-externs -Wold-style-definition -Wno-pointer-sign -Wdate-time -Wno-error=address -Wno-error=array-bounds -Wno-error=attributes -Wno-error=bool-compare -Wno-error=cast-align -Wno-error=clobbered -Wno-error=deprecated-declarations -Wno-error=enum-compare -Wno-error=extra -Wno-error=logical-not-parentheses -Wno-error=strict-aliasing -Wno-error=uninitialized -Wno-error=unused-function -Wno-error=unused-value -Wno-error=empty-body -Wno-error=maybe-uninitialized -Wno-error=nonnull-compare -Wno-error=shift-negative-value -Wno-error=tautological-compare -Wno-error=unused-const-variable -Wno-error=bool-operation -Wno-error=deprecated -Wno-error=expansion-to-defined -Wno-error=format-overflow -Wno-error=format-truncation -Wno-error=implicit-fallthrough -Wno-error=int-in-bool-context -Wno-error=memset-elt-size -Wno-error=noexcept-type -Wno-error=nonnull -Wno-error=pointer-compare -Wno-error=stringop-overflow -Wno-error=aggressive-loop-optimizations -Wno-error=cast-function-type -Wno-error=catch-value -Wno-error=multistatement-macros -Wno-error=restrict -Wno-error=sizeof-pointer-memaccess -Wno-error=stringop-truncation -Wno-return-type -c /workspace/src/usr.bin/expand/expand.c -o expand.pieo
--- all_subdir_tests ---
--- miscellaneous.full ---
/usr/local/bin/x86_64-unknown-freebsd14.3-gcc13 --sysroot=/tmp/obj/workspace/src/amd64.amd64/tmp -B/usr/local/x86_64-unknown-freebsd14.3/bin/ -O2 -pipe -fno-common -I/workspace/src/contrib/openbsm -ffile-prefix-map=/workspace/src=/usr/src -ffile-prefix-map=/tmp/obj/workspace/src=/usr/obj -g -std=gnu17 -Wno-format-zero-length -fstack-protector-strong -Wsystem-headers -Werror -Wall -Wno-format-y2k -W -Wno-unused-parameter -Wmissing-prototypes -Wpointer-arith -Wreturn-type -Wcast-qual -Wwrite-strings -Wswitch -Wshadow -Wunused-parameter -Wcast-align -Wchar-subscripts -Wnested-externs -Wold-style-definition -Wno-pointer-sign -Wdate-time -Wno-error=address -Wno-error=array-bounds -Wno-error=attributes -Wno-error=bool-compare -Wno-error=cast-align -Wno-error=clobbered -Wno-error=deprecated-declarations -Wno-error=enum-compare -Wno-error=extra -Wno-error=logical-not-parentheses -Wno-error=strict-aliasing -Wno-error=uninitialized -Wno-error=unused-function -Wno-error=unused-value -Wno-error=empty-body -Wno-error=maybe-uninitialized -Wno-error=nonnull-compare -Wno-error=shift-negative-value -Wno-error=tautological-compare -Wno-error=unused-const-variable -Wno-error=bool-operation -Wno-error=deprecated -Wno-error=expansion-to-defined -Wno-error=format-overflow -Wno-error=format-truncation -Wno-error=implicit-fallthrough -Wno-error=int-in-bool-context -Wno-error=memset-elt-size -Wno-error=noexcept-type -Wno-error=nonnull -Wno-error=pointer-compare -Wno-error=stringop-overflow -Wno-error=aggressive-loop-optimizations -Wno-error=cast-function-type -Wno-error=catch-value -Wno-error=multistatement-macros -Wno-error=restrict -Wno-error=sizeof-pointer-memaccess -Wno-error=stringop-truncation -Wno-return-type -lbsm -lutil -Wl,-zrelro -Wl,-znoexecstack -o miscellaneous.full miscellaneous.o utils.o /tmp/obj/workspace/src/amd64.amd64/tmp/usr/lib/libprivateauditd.a -lprivateatf-c
--- all_subdir_sbin ---
/workspace/src/sbin/routed/trace.c: In function 'set_tracefile':
/workspace/src/sbin/routed/trace.c:353:25: warning: 'strncpy' output may be truncated copying 1023 bytes from a string of length 1023 [-Wstringop-truncation]
353 | strncpy(savetracename, fn, sizeof(savetracename)-1);
| ^~~~~~~~~~~~~~~~~~~~~~~~~~~~~~~~~~~~~~~~~~~~~~~~~~~
--- all_subdir_tests ---
--- miscellaneous.debug ---
/usr/local/x86_64-unknown-freebsd14.3/bin/objcopy --only-keep-debug miscellaneous.full miscellaneous.debug
--- miscellaneous ---
/usr/local/x86_64-unknown-freebsd14.3/bin/objcopy --strip-debug --add-gnu-debuglink=miscellaneous.debug miscellaneous.full miscellaneous
--- all_subdir_tests/sys/capsicum ---
===> tests/sys/capsicum (all)
--- mini-me.pieo ---
/usr/local/bin/x86_64-unknown-freebsd14.3-gcc13 --sysroot=/tmp/obj/workspace/src/amd64.amd64/tmp -B/usr/local/x86_64-unknown-freebsd14.3/bin/ -fpie -DPIC -O2 -pipe -fno-common -I/workspace/src/tests -fPIE -ffile-prefix-map=/workspace/src=/usr/src -ffile-prefix-map=/tmp/obj/workspace/src=/usr/obj -g -std=gnu17 -Wno-format-zero-length -fstack-protector-strong -Wsystem-headers -Werror -Wall -Wno-format-y2k -W -Wno-unused-parameter -Wmissing-prototypes -Wpointer-arith -Wreturn-type -Wcast-qual -Wwrite-strings -Wswitch -Wshadow -Wunused-parameter -Wcast-align -Wchar-subscripts -Wnested-externs -Wold-style-definition -Wno-pointer-sign -Wdate-time -Wno-error=address -Wno-error=array-bounds -Wno-error=attributes -Wno-error=bool-compare -Wno-error=cast-align -Wno-error=clobbered -Wno-error=deprecated-declarations -Wno-error=enum-compare -Wno-error=extra -Wno-error=logical-not-parentheses -Wno-error=strict-aliasing -Wno-error=uninitialized -Wno-error=unused-function -Wno-error=unused-value -Wno-error=empty-body -Wno-error=maybe-uninitialized -Wno-error=nonnull-compare -Wno-error=shift-negative-value -Wno-error=tautological-compare -Wno-error=unused-const-variable -Wno-error=bool-operation -Wno-error=deprecated -Wno-error=expansion-to-defined -Wno-error=format-overflow -Wno-error=format-truncation -Wno-error=implicit-fallthrough -Wno-error=int-in-bool-context -Wno-error=memset-elt-size -Wno-error=noexcept-type -Wno-error=nonnull -Wno-error=pointer-compare -Wno-error=stringop-overflow -Wno-error=aggressive-loop-optimizations -Wno-error=cast-function-type -Wno-error=catch-value -Wno-error=multistatement-macros -Wno-error=restrict -Wno-error=sizeof-pointer-memaccess -Wno-error=stringop-truncation -Wno-return-type -c /workspace/src/contrib/capsicum-test/mini-me.c -o mini-me.pieo
--- all_subdir_rescue ---
--- bectl_jail.o ---
/usr/local/bin/x86_64-unknown-freebsd14.3-gcc13 --sysroot=/tmp/obj/workspace/src/amd64.amd64/tmp -B/usr/local/x86_64-unknown-freebsd14.3/bin/ -O2 -pipe -fno-common -DIN_BASE -I/workspace/src/sys/contrib/openzfs/include -I/workspace/src/sys/contrib/openzfs/lib/libspl/include/ -I/workspace/src/sys/contrib/openzfs/lib/libspl/include/os/freebsd -I/workspace/src/sys -I/workspace/src/cddl/compat/opensolaris/include -I/workspace/src/sys/contrib/openzfs/module/icp/include -include /workspace/src/sys/contrib/openzfs/include/os/freebsd/spl/sys/ccompile.h -DHAVE_ISSETUGID -DHAVE_STRLCAT -DHAVE_STRLCPY -include /workspace/src/sys/modules/zfs/zfs_config.h -DRESCUE -I/tmp/obj/workspace/src/amd64.amd64/lib/libifconfig -I/tmp/obj/workspace/src/amd64.amd64/lib/libiscsiutil -ffile-prefix-map=/workspace/src=/usr/src -ffile-prefix-map=/tmp/obj/workspace/src/amd64.amd64/rescue/rescue/workspace/src=/usr/obj -g -MD -MF.depend.bectl_jail.o -MTbectl_jail.o -std=gnu17 -Wno-format-zero-length -fstack-protector-strong -Wsystem-headers -Werror -Wall -Wno-format-y2k -W -Wno-unused-parameter -Wmissing-prototypes -Wpointer-arith -Wreturn-type -Wcast-qual -Wwrite-strings -Wswitch -Wshadow -Wunused-parameter -Wcast-align -Wchar-subscripts -Wnested-externs -Wold-style-definition -Wno-pointer-sign -Wdate-time -Wno-error=address -Wno-error=array-bounds -Wno-error=attributes -Wno-error=bool-compare -Wno-error=cast-align -Wno-error=clobbered -Wno-error=deprecated-declarations -Wno-error=enum-compare -Wno-error=extra -Wno-error=logical-not-parentheses -Wno-error=strict-aliasing -Wno-error=uninitialized -Wno-error=unused-function -Wno-error=unused-value -Wno-error=empty-body -Wno-error=maybe-uninitialized -Wno-error=nonnull-compare -Wno-error=shift-negative-value -Wno-error=tautological-compare -Wno-error=unused-const-variable -Wno-error=bool-operation -Wno-error=deprecated -Wno-error=expansion-to-defined -Wno-error=format-overflow -Wno-error=format-truncation -Wno-error=implicit-fallthrough -Wno-error=int-in-bool-context -Wno-error=memset-elt-size -Wno-error=noexcept-type -Wno-error=nonnull -Wno-error=pointer-compare -Wno-error=stringop-overflow -Wno-error=aggressive-loop-optimizations -Wno-error=cast-function-type -Wno-error=catch-value -Wno-error=multistatement-macros -Wno-error=restrict -Wno-error=sizeof-pointer-memaccess -Wno-error=stringop-truncation -Wno-return-type -c /workspace/src/sbin/bectl/bectl_jail.c -o bectl_jail.o
--- all_subdir_usr.bin ---
--- expand.full ---
/usr/local/bin/x86_64-unknown-freebsd14.3-gcc13 --sysroot=/tmp/obj/workspace/src/amd64.amd64/tmp -B/usr/local/x86_64-unknown-freebsd14.3/bin/ -O2 -pipe -fno-common -fPIE -ffile-prefix-map=/workspace/src=/usr/src -ffile-prefix-map=/tmp/obj/workspace/src=/usr/obj -g -std=gnu17 -Wno-format-zero-length -fstack-protector-strong -Wsystem-headers -Werror -Wall -Wno-format-y2k -W -Wno-unused-parameter -Wmissing-prototypes -Wpointer-arith -Wreturn-type -Wcast-qual -Wwrite-strings -Wswitch -Wshadow -Wunused-parameter -Wcast-align -Wchar-subscripts -Wnested-externs -Wold-style-definition -Wno-pointer-sign -Wdate-time -Wno-error=address -Wno-error=array-bounds -Wno-error=attributes -Wno-error=bool-compare -Wno-error=cast-align -Wno-error=clobbered -Wno-error=deprecated-declarations -Wno-error=enum-compare -Wno-error=extra -Wno-error=logical-not-parentheses -Wno-error=strict-aliasing -Wno-error=uninitialized -Wno-error=unused-function -Wno-error=unused-value -Wno-error=empty-body -Wno-error=maybe-uninitialized -Wno-error=nonnull-compare -Wno-error=shift-negative-value -Wno-error=tautological-compare -Wno-error=unused-const-variable -Wno-error=bool-operation -Wno-error=deprecated -Wno-error=expansion-to-defined -Wno-error=format-overflow -Wno-error=format-truncation -Wno-error=implicit-fallthrough -Wno-error=int-in-bool-context -Wno-error=memset-elt-size -Wno-error=noexcept-type -Wno-error=nonnull -Wno-error=pointer-compare -Wno-error=stringop-overflow -Wno-error=aggressive-loop-optimizations -Wno-error=cast-function-type -Wno-error=catch-value -Wno-error=multistatement-macros -Wno-error=restrict -Wno-error=sizeof-pointer-memaccess -Wno-error=stringop-truncation -Wno-return-type -Wl,-zrelro -pie -Wl,-znoexecstack -o expand.full expand.pieo
--- all_subdir_tests ---
--- functional ---
echo '#! /usr/libexec/atf-sh' > functional.tmp
cat /workspace/src/tests/sys/capsicum/functional.sh >>functional.tmp
chmod +x functional.tmp
mv functional.tmp functional
--- Kyuafile ---
--- mini-me ---
(cd /workspace/src/tests/sys/capsicum && DEPENDFILE=.depend.mini-me NO_SUBDIR=1 make -f /workspace/src/tests/sys/capsicum/Makefile _RECURSING_PROGS=t PROG=mini-me )
--- all_subdir_usr.bin ---
--- expand.1.gz ---
gzip -cn /workspace/src/usr.bin/expand/expand.1 > expand.1.gz
--- expand.debug ---
/usr/local/x86_64-unknown-freebsd14.3/bin/objcopy --only-keep-debug expand.full expand.debug
--- expand ---
/usr/local/x86_64-unknown-freebsd14.3/bin/objcopy --strip-debug --add-gnu-debuglink=expand.debug expand.full expand
--- all_subdir_tests ---
--- .depend.mini-me ---
echo mini-me.full: /tmp/obj/workspace/src/amd64.amd64/tmp/usr/lib/libc.a >> .depend.mini-me
--- mini-me.o ---
--- mini-me.noexec ---
--- mini-me ---
/usr/local/bin/x86_64-unknown-freebsd14.3-gcc13 --sysroot=/tmp/obj/workspace/src/amd64.amd64/tmp -B/usr/local/x86_64-unknown-freebsd14.3/bin/ -O2 -pipe -fno-common -I/workspace/src/tests -ffile-prefix-map=/workspace/src=/usr/src -ffile-prefix-map=/tmp/obj/workspace/src=/usr/obj -g -MD -MF.depend.mini-me.mini-me.o -MTmini-me.o -std=gnu17 -Wno-format-zero-length -fstack-protector-strong -Wsystem-headers -Werror -Wall -Wno-format-y2k -W -Wno-unused-parameter -Wmissing-prototypes -Wpointer-arith -Wreturn-type -Wcast-qual -Wwrite-strings -Wswitch -Wshadow -Wunused-parameter -Wcast-align -Wchar-subscripts -Wnested-externs -Wold-style-definition -Wno-pointer-sign -Wdate-time -Wno-error=address -Wno-error=array-bounds -Wno-error=attributes -Wno-error=bool-compare -Wno-error=cast-align -Wno-error=clobbered -Wno-error=deprecated-declarations -Wno-error=enum-compare -Wno-error=extra -Wno-error=logical-not-parentheses -Wno-error=strict-aliasing -Wno-error=uninitialized -Wno-error=unused-function -Wno-error=unused-value -Wno-error=empty-body -Wno-error=maybe-uninitialized -Wno-error=nonnull-compare -Wno-error=shift-negative-value -Wno-error=tautological-compare -Wno-error=unused-const-variable -Wno-error=bool-operation -Wno-error=deprecated -Wno-error=expansion-to-defined -Wno-error=format-overflow -Wno-error=format-truncation -Wno-error=implicit-fallthrough -Wno-error=int-in-bool-context -Wno-error=memset-elt-size -Wno-error=noexcept-type -Wno-error=nonnull -Wno-error=pointer-compare -Wno-error=stringop-overflow -Wno-error=aggressive-loop-optimizations -Wno-error=cast-function-type -Wno-error=catch-value -Wno-error=multistatement-macros -Wno-error=restrict -Wno-error=sizeof-pointer-memaccess -Wno-error=stringop-truncation -Wno-return-type -c /workspace/src/contrib/capsicum-test/mini-me.c -o mini-me.o
--- mini-me.noexec ---
(cd /workspace/src/tests/sys/capsicum && DEPENDFILE=.depend.mini-me.noexec NO_SUBDIR=1 make -f /workspace/src/tests/sys/capsicum/Makefile _RECURSING_PROGS=t PROG=mini-me.noexec )
--- .depend.mini-me.noexec ---
echo mini-me.noexec.full: /tmp/obj/workspace/src/amd64.amd64/tmp/usr/lib/libc.a >> .depend.mini-me.noexec
--- mini-me.noexec.full ---
/usr/local/bin/x86_64-unknown-freebsd14.3-gcc13 --sysroot=/tmp/obj/workspace/src/amd64.amd64/tmp -B/usr/local/x86_64-unknown-freebsd14.3/bin/ -O2 -pipe -fno-common -I/workspace/src/tests -ffile-prefix-map=/workspace/src=/usr/src -ffile-prefix-map=/tmp/obj/workspace/src=/usr/obj -g -std=gnu17 -Wno-format-zero-length -fstack-protector-strong -Wsystem-headers -Werror -Wall -Wno-format-y2k -W -Wno-unused-parameter -Wmissing-prototypes -Wpointer-arith -Wreturn-type -Wcast-qual -Wwrite-strings -Wswitch -Wshadow -Wunused-parameter -Wcast-align -Wchar-subscripts -Wnested-externs -Wold-style-definition -Wno-pointer-sign -Wdate-time -Wno-error=address -Wno-error=array-bounds -Wno-error=attributes -Wno-error=bool-compare -Wno-error=cast-align -Wno-error=clobbered -Wno-error=deprecated-declarations -Wno-error=enum-compare -Wno-error=extra -Wno-error=logical-not-parentheses -Wno-error=strict-aliasing -Wno-error=uninitialized -Wno-error=unused-function -Wno-error=unused-value -Wno-error=empty-body -Wno-error=maybe-uninitialized -Wno-error=nonnull-compare -Wno-error=shift-negative-value -Wno-error=tautological-compare -Wno-error=unused-const-variable -Wno-error=bool-operation -Wno-error=deprecated -Wno-error=expansion-to-defined -Wno-error=format-overflow -Wno-error=format-truncation -Wno-error=implicit-fallthrough -Wno-error=int-in-bool-context -Wno-error=memset-elt-size -Wno-error=noexcept-type -Wno-error=nonnull -Wno-error=pointer-compare -Wno-error=stringop-overflow -Wno-error=aggressive-loop-optimizations -Wno-error=cast-function-type -Wno-error=catch-value -Wno-error=multistatement-macros -Wno-error=restrict -Wno-error=sizeof-pointer-memaccess -Wno-error=stringop-truncation -Wno-return-type -Wl,-zrelro -static -Wl,-znoexecstack -o mini-me.noexec.full mini-me.o
--- all_subdir_rescue ---
/workspace/src/sbin/bectl/bectl_jail.c: In function 'bectl_cmd_jail':
/workspace/src/sbin/bectl/bectl_jail.c:263:68: warning: '%s' directive argument is null [-Wformat-overflow=]
263 | "bectl jail: error unsetting \"%s\"\n",
| ^~
--- bectl_list.o ---
/usr/local/bin/x86_64-unknown-freebsd14.3-gcc13 --sysroot=/tmp/obj/workspace/src/amd64.amd64/tmp -B/usr/local/x86_64-unknown-freebsd14.3/bin/ -O2 -pipe -fno-common -DIN_BASE -I/workspace/src/sys/contrib/openzfs/include -I/workspace/src/sys/contrib/openzfs/lib/libspl/include/ -I/workspace/src/sys/contrib/openzfs/lib/libspl/include/os/freebsd -I/workspace/src/sys -I/workspace/src/cddl/compat/opensolaris/include -I/workspace/src/sys/contrib/openzfs/module/icp/include -include /workspace/src/sys/contrib/openzfs/include/os/freebsd/spl/sys/ccompile.h -DHAVE_ISSETUGID -DHAVE_STRLCAT -DHAVE_STRLCPY -include /workspace/src/sys/modules/zfs/zfs_config.h -DRESCUE -I/tmp/obj/workspace/src/amd64.amd64/lib/libifconfig -I/tmp/obj/workspace/src/amd64.amd64/lib/libiscsiutil -ffile-prefix-map=/workspace/src=/usr/src -ffile-prefix-map=/tmp/obj/workspace/src/amd64.amd64/rescue/rescue/workspace/src=/usr/obj -g -MD -MF.depend.bectl_list.o -MTbectl_list.o -std=gnu17 -Wno-format-zero-length -fstack-protector-strong -Wsystem-headers -Werror -Wall -Wno-format-y2k -W -Wno-unused-parameter -Wmissing-prototypes -Wpointer-arith -Wreturn-type -Wcast-qual -Wwrite-strings -Wswitch -Wshadow -Wunused-parameter -Wcast-align -Wchar-subscripts -Wnested-externs -Wold-style-definition -Wno-pointer-sign -Wdate-time -Wno-error=address -Wno-error=array-bounds -Wno-error=attributes -Wno-error=bool-compare -Wno-error=cast-align -Wno-error=clobbered -Wno-error=deprecated-declarations -Wno-error=enum-compare -Wno-error=extra -Wno-error=logical-not-parentheses -Wno-error=strict-aliasing -Wno-error=uninitialized -Wno-error=unused-function -Wno-error=unused-value -Wno-error=empty-body -Wno-error=maybe-uninitialized -Wno-error=nonnull-compare -Wno-error=shift-negative-value -Wno-error=tautological-compare -Wno-error=unused-const-variable -Wno-error=bool-operation -Wno-error=deprecated -Wno-error=expansion-to-defined -Wno-error=format-overflow -Wno-error=format-truncation -Wno-error=implicit-fallthrough -Wno-error=int-in-bool-context -Wno-error=memset-elt-size -Wno-error=noexcept-type -Wno-error=nonnull -Wno-error=pointer-compare -Wno-error=stringop-overflow -Wno-error=aggressive-loop-optimizations -Wno-error=cast-function-type -Wno-error=catch-value -Wno-error=multistatement-macros -Wno-error=restrict -Wno-error=sizeof-pointer-memaccess -Wno-error=stringop-truncation -Wno-return-type -c /workspace/src/sbin/bectl/bectl_list.c -o bectl_list.o
--- all_subdir_tests ---
--- mini-me ---
--- mini-me.full ---
/usr/local/bin/x86_64-unknown-freebsd14.3-gcc13 --sysroot=/tmp/obj/workspace/src/amd64.amd64/tmp -B/usr/local/x86_64-unknown-freebsd14.3/bin/ -O2 -pipe -fno-common -I/workspace/src/tests -ffile-prefix-map=/workspace/src=/usr/src -ffile-prefix-map=/tmp/obj/workspace/src=/usr/obj -g -std=gnu17 -Wno-format-zero-length -fstack-protector-strong -Wsystem-headers -Werror -Wall -Wno-format-y2k -W -Wno-unused-parameter -Wmissing-prototypes -Wpointer-arith -Wreturn-type -Wcast-qual -Wwrite-strings -Wswitch -Wshadow -Wunused-parameter -Wcast-align -Wchar-subscripts -Wnested-externs -Wold-style-definition -Wno-pointer-sign -Wdate-time -Wno-error=address -Wno-error=array-bounds -Wno-error=attributes -Wno-error=bool-compare -Wno-error=cast-align -Wno-error=clobbered -Wno-error=deprecated-declarations -Wno-error=enum-compare -Wno-error=extra -Wno-error=logical-not-parentheses -Wno-error=strict-aliasing -Wno-error=uninitialized -Wno-error=unused-function -Wno-error=unused-value -Wno-error=empty-body -Wno-error=maybe-uninitialized -Wno-error=nonnull-compare -Wno-error=shift-negative-value -Wno-error=tautological-compare -Wno-error=unused-const-variable -Wno-error=bool-operation -Wno-error=deprecated -Wno-error=expansion-to-defined -Wno-error=format-overflow -Wno-error=format-truncation -Wno-error=implicit-fallthrough -Wno-error=int-in-bool-context -Wno-error=memset-elt-size -Wno-error=noexcept-type -Wno-error=nonnull -Wno-error=pointer-compare -Wno-error=stringop-overflow -Wno-error=aggressive-loop-optimizations -Wno-error=cast-function-type -Wno-error=catch-value -Wno-error=multistatement-macros -Wno-error=restrict -Wno-error=sizeof-pointer-memaccess -Wno-error=stringop-truncation -Wno-return-type -Wl,-zrelro -static -Wl,-znoexecstack -o mini-me.full mini-me.o
--- all_subdir_usr.sbin ---
--- dumpcis.full ---
/usr/local/bin/x86_64-unknown-freebsd14.3-gcc13 --sysroot=/tmp/obj/workspace/src/amd64.amd64/tmp -B/usr/local/x86_64-unknown-freebsd14.3/bin/ -O2 -pipe -fno-common -fPIE -ffile-prefix-map=/workspace/src=/usr/src -ffile-prefix-map=/tmp/obj/workspace/src=/usr/obj -g -std=gnu17 -Wno-format-zero-length -fstack-protector-strong -Wsystem-headers -Werror -Wall -Wno-format-y2k -W -Wno-unused-parameter -Wmissing-prototypes -Wpointer-arith -Wreturn-type -Wcast-qual -Wwrite-strings -Wswitch -Wshadow -Wunused-parameter -Wcast-align -Wchar-subscripts -Wnested-externs -Wold-style-definition -Wno-pointer-sign -Wdate-time -Wno-error=address -Wno-error=array-bounds -Wno-error=attributes -Wno-error=bool-compare -Wno-error=cast-align -Wno-error=clobbered -Wno-error=deprecated-declarations -Wno-error=enum-compare -Wno-error=extra -Wno-error=logical-not-parentheses -Wno-error=strict-aliasing -Wno-error=uninitialized -Wno-error=unused-function -Wno-error=unused-value -Wno-error=empty-body -Wno-error=maybe-uninitialized -Wno-error=nonnull-compare -Wno-error=shift-negative-value -Wno-error=tautological-compare -Wno-error=unused-const-variable -Wno-error=bool-operation -Wno-error=deprecated -Wno-error=expansion-to-defined -Wno-error=format-overflow -Wno-error=format-truncation -Wno-error=implicit-fallthrough -Wno-error=int-in-bool-context -Wno-error=memset-elt-size -Wno-error=noexcept-type -Wno-error=nonnull -Wno-error=pointer-compare -Wno-error=stringop-overflow -Wno-error=aggressive-loop-optimizations -Wno-error=cast-function-type -Wno-error=catch-value -Wno-error=multistatement-macros -Wno-error=restrict -Wno-error=sizeof-pointer-memaccess -Wno-error=stringop-truncation -Wno-return-type -Wl,-zrelro -pie -Wl,-znoexecstack -o dumpcis.full main.pieo readcis.pieo printcis.pieo
--- all_subdir_sbin ---
--- all_subdir_sbin/pfctl ---
--- all_subdir_sbin/pfctl/tests ---
===> sbin/pfctl/tests (all)
--- pfctl_test ---
(cd /workspace/src/sbin/pfctl/tests && DEPENDFILE=.depend.pfctl_test NO_SUBDIR=1 make -f /workspace/src/sbin/pfctl/tests/Makefile _RECURSING_PROGS=t PROG=pfctl_test )
--- all_subdir_usr.sbin ---
--- dumpcis.8.gz ---
gzip -cn /workspace/src/usr.sbin/dumpcis/dumpcis.8 > dumpcis.8.gz
--- dumpcis.debug ---
/usr/local/x86_64-unknown-freebsd14.3/bin/objcopy --only-keep-debug dumpcis.full dumpcis.debug
--- dumpcis ---
/usr/local/x86_64-unknown-freebsd14.3/bin/objcopy --strip-debug --add-gnu-debuglink=dumpcis.debug dumpcis.full dumpcis
--- all_subdir_usr.sbin/etcupdate ---
===> usr.sbin/etcupdate (all)
--- all_subdir_tests ---
--- all_subdir_tests/sys/cddl ---
===> tests/sys/cddl (all)
--- all_subdir_sbin ---
--- all_subdir_sbin/routed ---
--- all_subdir_sbin/routed/rtquery ---
===> sbin/routed/rtquery (all)
--- all_subdir_sbin/pfctl ---
--- .depend.pfctl_test ---
echo pfctl_test.full: /tmp/obj/workspace/src/amd64.amd64/tmp/usr/lib/libc.a /tmp/obj/workspace/src/amd64.amd64/tmp/usr/lib/libprivateatf-c.a /tmp/obj/workspace/src/amd64.amd64/tmp/usr/lib/libsbuf.a >> .depend.pfctl_test
--- pfctl_test.pieo ---
--- all_subdir_usr.sbin ---
--- all_subdir_usr.sbin/etcupdate/tests ---
===> usr.sbin/etcupdate/tests (all)
--- all_subdir_sbin ---
/usr/local/bin/x86_64-unknown-freebsd14.3-gcc13 --sysroot=/tmp/obj/workspace/src/amd64.amd64/tmp -B/usr/local/x86_64-unknown-freebsd14.3/bin/ -fpie -DPIC -O2 -pipe -fno-common -fPIE -ffile-prefix-map=/workspace/src=/usr/src -ffile-prefix-map=/tmp/obj/workspace/src=/usr/obj -g -MD -MF.depend.pfctl_test.pfctl_test.pieo -MTpfctl_test.pieo -std=gnu17 -Wno-format-zero-length -fstack-protector-strong -Wsystem-headers -Werror -Wall -Wno-format-y2k -W -Wno-unused-parameter -Wmissing-prototypes -Wpointer-arith -Wreturn-type -Wcast-qual -Wwrite-strings -Wswitch -Wshadow -Wunused-parameter -Wcast-align -Wchar-subscripts -Wnested-externs -Wold-style-definition -Wno-pointer-sign -Wdate-time -Wno-error=address -Wno-error=array-bounds -Wno-error=attributes -Wno-error=bool-compare -Wno-error=cast-align -Wno-error=clobbered -Wno-error=deprecated-declarations -Wno-error=enum-compare -Wno-error=extra -Wno-error=logical-not-parentheses -Wno-error=strict-aliasing -Wno-error=uninitialized -Wno-error=unused-function -Wno-error=unused-value -Wno-error=empty-body -Wno-error=maybe-uninitialized -Wno-error=nonnull-compare -Wno-error=shift-negative-value -Wno-error=tautological-compare -Wno-error=unused-const-variable -Wno-error=bool-operation -Wno-error=deprecated -Wno-error=expansion-to-defined -Wno-error=format-overflow -Wno-error=format-truncation -Wno-error=implicit-fallthrough -Wno-error=int-in-bool-context -Wno-error=memset-elt-size -Wno-error=noexcept-type -Wno-error=nonnull -Wno-error=pointer-compare -Wno-error=stringop-overflow -Wno-error=aggressive-loop-optimizations -Wno-error=cast-function-type -Wno-error=catch-value -Wno-error=multistatement-macros -Wno-error=restrict -Wno-error=sizeof-pointer-memaccess -Wno-error=stringop-truncation -Wno-return-type -c /workspace/src/sbin/pfctl/tests/pfctl_test.c -o pfctl_test.pieo
--- all_subdir_tests ---
--- all_subdir_tests/sys/cddl/zfs ---
===> tests/sys/cddl/zfs (all)
--- all_subdir_tests/sys/capsicum ---
--- mini-me.noexec ---
/usr/local/bin/x86_64-unknown-freebsd14.3-ld: /tmp/obj/workspace/src/amd64.amd64/tmp/usr/lib/crt1.o: in function `_start':
/usr/src/lib/csu/amd64/crt1_s.S:66:(.text+0x17): undefined reference to `main'
--- all_subdir_sbin ---
--- all_subdir_sbin/routed ---
--- .depend ---
echo rtquery.full: /tmp/obj/workspace/src/amd64.amd64/tmp/usr/lib/libc.a /tmp/obj/workspace/src/amd64.amd64/tmp/usr/lib/libmd.a >> .depend
--- rtquery.pieo ---
/usr/local/bin/x86_64-unknown-freebsd14.3-gcc13 --sysroot=/tmp/obj/workspace/src/amd64.amd64/tmp -B/usr/local/x86_64-unknown-freebsd14.3/bin/ -fpie -DPIC -O2 -pipe -fno-common -fPIE -ffile-prefix-map=/workspace/src=/usr/src -ffile-prefix-map=/tmp/obj/workspace/src=/usr/obj -g -MD -MF.depend.rtquery.pieo -MTrtquery.pieo -std=gnu17 -Wno-format-zero-length -fstack-protector-strong -Wsystem-headers -Werror -Wall -Wno-format-y2k -W -Wno-unused-parameter -Wmissing-prototypes -Wpointer-arith -Wno-uninitialized -Wno-pointer-sign -Wdate-time -Wno-error=address -Wno-error=array-bounds -Wno-error=attributes -Wno-error=bool-compare -Wno-error=cast-align -Wno-error=clobbered -Wno-error=deprecated-declarations -Wno-error=enum-compare -Wno-error=extra -Wno-error=logical-not-parentheses -Wno-error=strict-aliasing -Wno-error=uninitialized -Wno-error=unused-function -Wno-error=unused-value -Wno-error=empty-body -Wno-error=maybe-uninitialized -Wno-error=nonnull-compare -Wno-error=shift-negative-value -Wno-error=tautological-compare -Wno-error=unused-const-variable -Wno-error=bool-operation -Wno-error=deprecated -Wno-error=expansion-to-defined -Wno-error=format-overflow -Wno-error=format-truncation -Wno-error=implicit-fallthrough -Wno-error=int-in-bool-context -Wno-error=memset-elt-size -Wno-error=noexcept-type -Wno-error=nonnull -Wno-error=pointer-compare -Wno-error=stringop-overflow -Wno-error=aggressive-loop-optimizations -Wno-error=cast-function-type -Wno-error=catch-value -Wno-error=multistatement-macros -Wno-error=restrict -Wno-error=sizeof-pointer-memaccess -Wno-error=stringop-truncation -Wno-return-type -Wno-address-of-packed-member -c /workspace/src/sbin/routed/rtquery/rtquery.c -o rtquery.pieo
--- all_subdir_tests ---
--- all_subdir_tests/sys/cddl ---
--- all_subdir_tests/sys/cddl/zfs/bin ---
===> tests/sys/cddl/zfs/bin (all)
--- all_subdir_usr.sbin ---
--- always_test ---
cat /workspace/src/usr.sbin/etcupdate/tests/always_test.sh >always_test.tmp
chmod +x always_test.tmp
mv always_test.tmp always_test
--- conflicts_test ---
cat /workspace/src/usr.sbin/etcupdate/tests/conflicts_test.sh >conflicts_test.tmp
chmod +x conflicts_test.tmp
--- all_subdir_tests ---
--- chg_usr_exec ---
--- all_subdir_usr.sbin ---
mv conflicts_test.tmp conflicts_test
--- all_subdir_tests ---
(cd /workspace/src/tests/sys/cddl/zfs/bin && DEPENDFILE=.depend.chg_usr_exec NO_SUBDIR=1 make -f /workspace/src/tests/sys/cddl/zfs/bin/Makefile _RECURSING_PROGS=t PROG=chg_usr_exec )
--- all_subdir_usr.sbin ---
--- fbsdid_test ---
cat /workspace/src/usr.sbin/etcupdate/tests/fbsdid_test.sh >fbsdid_test.tmp
chmod +x fbsdid_test.tmp
mv fbsdid_test.tmp fbsdid_test
--- ignore_test ---
cat /workspace/src/usr.sbin/etcupdate/tests/ignore_test.sh >ignore_test.tmp
chmod +x ignore_test.tmp
mv ignore_test.tmp ignore_test
--- preworld_test ---
cat /workspace/src/usr.sbin/etcupdate/tests/preworld_test.sh >preworld_test.tmp
chmod +x preworld_test.tmp
mv preworld_test.tmp preworld_test
--- tests_test ---
cat /workspace/src/usr.sbin/etcupdate/tests/tests_test.sh >tests_test.tmp
--- all_subdir_tests ---
--- .depend.chg_usr_exec ---
--- all_subdir_usr.sbin ---
chmod +x tests_test.tmp
--- all_subdir_tests ---
echo chg_usr_exec.full: /tmp/obj/workspace/src/amd64.amd64/tmp/usr/lib/libc.a >> .depend.chg_usr_exec
--- all_subdir_usr.sbin ---
mv tests_test.tmp tests_test
--- all_subdir_tests ---
--- chg_usr_exec.pieo ---
/usr/local/bin/x86_64-unknown-freebsd14.3-gcc13 --sysroot=/tmp/obj/workspace/src/amd64.amd64/tmp -B/usr/local/x86_64-unknown-freebsd14.3/bin/ -fpie -DPIC -O2 -pipe -fno-common -fPIE -ffile-prefix-map=/workspace/src=/usr/src -ffile-prefix-map=/tmp/obj/workspace/src=/usr/obj -g -MD -MF.depend.chg_usr_exec.chg_usr_exec.pieo -MTchg_usr_exec.pieo -std=gnu17 -Wno-format-zero-length -fstack-protector-strong -Wno-pointer-sign -Wdate-time -Wno-error=address -Wno-error=array-bounds -Wno-error=attributes -Wno-error=bool-compare -Wno-error=cast-align -Wno-error=clobbered -Wno-error=deprecated-declarations -Wno-error=enum-compare -Wno-error=extra -Wno-error=logical-not-parentheses -Wno-error=strict-aliasing -Wno-error=uninitialized -Wno-error=unused-function -Wno-error=unused-value -Wno-error=empty-body -Wno-error=maybe-uninitialized -Wno-error=nonnull-compare -Wno-error=shift-negative-value -Wno-error=tautological-compare -Wno-error=unused-const-variable -Wno-error=bool-operation -Wno-error=deprecated -Wno-error=expansion-to-defined -Wno-error=format-overflow -Wno-error=format-truncation -Wno-error=implicit-fallthrough -Wno-error=int-in-bool-context -Wno-error=memset-elt-size -Wno-error=noexcept-type -Wno-error=nonnull -Wno-error=pointer-compare -Wno-error=stringop-overflow -Wno-error=aggressive-loop-optimizations -Wno-error=cast-function-type -Wno-error=catch-value -Wno-error=multistatement-macros -Wno-error=restrict -Wno-error=sizeof-pointer-memaccess -Wno-error=stringop-truncation -Wno-return-type -Wno-address-of-packed-member -c /workspace/src/tests/sys/cddl/zfs/bin/chg_usr_exec.c -o chg_usr_exec.pieo
--- all_subdir_usr.sbin ---
--- tzsetup_test ---
cat /workspace/src/usr.sbin/etcupdate/tests/tzsetup_test.sh >tzsetup_test.tmp
chmod +x tzsetup_test.tmp
mv tzsetup_test.tmp tzsetup_test
--- Kyuafile ---
--- etcupdate.8.gz ---
gzip -cn /workspace/src/usr.sbin/etcupdate/etcupdate.8 > etcupdate.8.gz
--- all_subdir_tests ---
--- dir_rd_update ---
(cd /workspace/src/tests/sys/cddl/zfs/bin && DEPENDFILE=.depend.dir_rd_update NO_SUBDIR=1 make -f /workspace/src/tests/sys/cddl/zfs/bin/Makefile _RECURSING_PROGS=t PROG=dir_rd_update )
--- all_subdir_tests/sys/capsicum ---
collect2: error: ld returned 1 exit status
make[3]: stopped in /workspace/src/tests
--- all_subdir_usr.sbin ---
make[2]: stopped in /workspace/src
--- all_subdir_rescue ---
*** [objs] Error code 6
make[4]: stopped in /workspace/src/rescue/rescue
1 error
make[4]: stopped in /workspace/src/rescue/rescue
--- all_subdir_usr.bin ---
make[2]: stopped in /workspace/src
--- all_subdir_tests ---
make[2]: stopped in /workspace/src
--- all_subdir_sbin ---
make[2]: stopped in /workspace/src
--- all_subdir_rescue ---
make[3]: stopped in /workspace/src/rescue
make[2]: stopped in /workspace/src
--- all_subdir_lib ---
make[3]: stopped in /workspace/src/lib
make[2]: stopped in /workspace/src
--- all_subdir_cddl ---
make[6]: stopped in /workspace/src/cddl/usr.sbin/zfsd/tests
make[5]: stopped in /workspace/src/cddl/usr.sbin/zfsd
make[4]: stopped in /workspace/src/cddl/usr.sbin
make[3]: stopped in /workspace/src/cddl
make[2]: stopped in /workspace/src
88.69 real 716.11 user 86.53 sys
make[1]: stopped in /workspace/src
make: stopped in /workspace/src
Build step 'Execute shell' marked build as failure
[WARNINGS]Skipping publisher since build result is FAILURE
[PostBuildScript] - [INFO] Executing post build scripts.
[FreeBSD-stable-15-amd64-gcc13_build] $ /bin/sh -xe /tmp/jenkins5088707684900803242.sh
+ sh freebsd-ci/scripts/jail/clean.sh
clean jail FreeBSD-stable-15-amd64-gcc13_build
Checking for post-build
Performing post-build step
Checking if email needs to be generated
Email was triggered for: Failure - Any
Sending email for trigger: Failure - Any
Sending mail from default account using System Admin e-mail address