FreeBSD-stable-14-amd64-test - Build #1217 - Still Unstable
- In reply to: jenkins-admin_a_FreeBSD.org: "FreeBSD-stable-14-amd64-test - Build #1216 - Still Unstable"
- Go to: [ bottom of page ] [ top of archives ] [ this month ]
Date: Sat, 31 May 2025 06:03:36 UTC
FreeBSD-stable-14-amd64-test - Build #1217 (1e8f26125fe8442ebf499b2bb25d78d779ddb574) - Still Unstable
Build information: https://ci.FreeBSD.org/job/FreeBSD-stable-14-amd64-test/1217/
Full change log: https://ci.FreeBSD.org/job/FreeBSD-stable-14-amd64-test/1217/changes
Full build log: https://ci.FreeBSD.org/job/FreeBSD-stable-14-amd64-test/1217/console
Status explanation:
"Unstable" - some tests are suspected being broken by the following changes
"Still Unstable" - the failing test cases have not been fixed by these
following changes and this is a notification to note that
these changes have not been fully tested by the CI system
Change summaries:
(Those commits are likely but not certainly responsible)
1e8f26125fe8442ebf499b2bb25d78d779ddb574 by kib:
libc: set close-on-exec for temp socket used to detect IPv6 support
The failed test cases:
3 tests failed.
FAILED: bin.pwait.pwait_test.time_unit
Error Message:
atf-check failed; see the output of the test for details
FAILED: sys.netinet.fibs_test.same_ip_multiple_ifaces_fib0
Error Message:
atf-check failed; see the output of the test for details
FAILED: sys.netlink.test_netlink_message_writer.py.__test_cases_list__
Error Message:
Test program did not exit cleanly