FreeBSD-main-amd64-test - Build #26500 - Still Unstable

From: <jenkins-admin_at_FreeBSD.org>
Date: Thu, 29 May 2025 03:34:54 UTC
FreeBSD-main-amd64-test - Build #26500 (cba5d7ab32fd0b4e9c4312cc967baf137377f812) - Still Unstable

Build information: https://ci.FreeBSD.org/job/FreeBSD-main-amd64-test/26500/
Full change log: https://ci.FreeBSD.org/job/FreeBSD-main-amd64-test/26500/changes
Full build log: https://ci.FreeBSD.org/job/FreeBSD-main-amd64-test/26500/console

Status explanation:
"Unstable" - some tests are suspected being broken by the following changes
"Still Unstable" - the failing test cases have not been fixed by these
                   following changes and this is a notification to note that
                   these changes have not been fully tested by the CI system

Change summaries:
(Those commits are likely but not certainly responsible)

cba5d7ab32fd0b4e9c4312cc967baf137377f812 by emaste:
atkbd: Fix first keystroke force reset



The failed test cases:

6 tests failed.
FAILED:  sys.opencrypto.runtests.main

Error Message:
1 of 1 tests failed

FAILED:  sys.kqueue.libkqueue.kqueue_test.main

Error Message:
Received signal 6

FAILED:  sys.netgraph.ksocket.udp_bind

Error Message:
/usr/src/tests/sys/netgraph/ksocket.c:104: connect(us, (struct sockaddr *)rep->data, sizeof(struct sockaddr_in)) == 0 not met

FAILED:  sys.netgraph.ksocket.udp_connect

Error Message:
/usr/src/tests/sys/netgraph/ksocket.c:72: NgSendMsg(cs, ".:" OURHOOK, NGM_KSOCKET_COOKIE, NGM_KSOCKET_CONNECT, &sa, sizeof(sa)) >= 0 not met

FAILED:  sys.netinet.broadcast.INADDR_BROADCAST

Error Message:
/usr/src/tests/sys/netinet/broadcast.c:65: sending of broadcast failed: 51

FAILED:  sys.netinet.fibs_test.same_ip_multiple_ifaces_fib0

Error Message:
atf-check failed; see the output of the test for details