FreeBSD-stable-14-amd64-test - Build #1209 - Still Unstable
Date: Wed, 28 May 2025 12:40:41 UTC
FreeBSD-stable-14-amd64-test - Build #1209 (5c10e8eae0f071799744f55bc99ef3b712b698ba) - Still Unstable
Build information: https://ci.FreeBSD.org/job/FreeBSD-stable-14-amd64-test/1209/
Full change log: https://ci.FreeBSD.org/job/FreeBSD-stable-14-amd64-test/1209/changes
Full build log: https://ci.FreeBSD.org/job/FreeBSD-stable-14-amd64-test/1209/console
Status explanation:
"Unstable" - some tests are suspected being broken by the following changes
"Still Unstable" - the failing test cases have not been fixed by these
following changes and this is a notification to note that
these changes have not been fully tested by the CI system
Change summaries:
(Those commits are likely but not certainly responsible)
5c10e8eae0f071799744f55bc99ef3b712b698ba by kib:
open.2: add a note about conversion of a file descriptor into O_PATH
The failed test cases:
4 tests failed.
FAILED: sys.netpfil.common.dummynet.pf_queue
Error Message:
We failed prioritisation 1 times
FAILED: bin.pwait.pwait_test.time_unit
Error Message:
atf-check failed; see the output of the test for details
FAILED: sys.netinet.fibs_test.same_ip_multiple_ifaces_fib0
Error Message:
atf-check failed; see the output of the test for details
FAILED: sys.netlink.test_netlink_message_writer.py.__test_cases_list__
Error Message:
Test program did not exit cleanly