FreeBSD-stable-14-amd64-test - Build #1206 - Still unstable

From: <jenkins-admin_at_FreeBSD.org>
Date: Tue, 27 May 2025 21:58:25 UTC
FreeBSD-stable-14-amd64-test - Build #1206 (9a4e5a8a714cf8f5497b7c9b8944a13e19be0eb7) - Still unstable

Build information: https://ci.FreeBSD.org/job/FreeBSD-stable-14-amd64-test/1206/
Full change log: https://ci.FreeBSD.org/job/FreeBSD-stable-14-amd64-test/1206/changes
Full build log: https://ci.FreeBSD.org/job/FreeBSD-stable-14-amd64-test/1206/console

Status explanation:
"Unstable" - some tests are suspected being broken by the following changes
"Still Unstable" - the failing test cases have not been fixed by these
                   following changes and this is a notification to note that
                   these changes have not been fully tested by the CI system

Change summaries:
(Those commits are likely but not certainly responsible)

30f092c40ad4eb592861839f4ffa9e9891abf1d3 by olce:
MAC/do: Fix a too stringent debug assertion for a target of 'uid=*'

3fb4073c4c8cd1f7f4706bc7750a7551f3ae08aa by np:
pciconf(8): Fix the -x option and its documentation

9a4e5a8a714cf8f5497b7c9b8944a13e19be0eb7 by np:
pciconf(8): Dump the correct number of bytes



The failed test cases:

4 tests failed.
FAILED:  sys.opencrypto.runtests.main

Error Message:
1 of 1 tests failed

FAILED:  bin.pwait.pwait_test.time_unit

Error Message:
atf-check failed; see the output of the test for details

FAILED:  sys.netinet.fibs_test.same_ip_multiple_ifaces_fib0

Error Message:
atf-check failed; see the output of the test for details

FAILED:  sys.netlink.test_netlink_message_writer.py.__test_cases_list__

Error Message:
Test program did not exit cleanly