FreeBSD-main-amd64-test - Build #26465 - Still Unstable

From: <jenkins-admin_at_FreeBSD.org>
Date: Sat, 24 May 2025 19:24:52 UTC
FreeBSD-main-amd64-test - Build #26465 (eba403923626f2ecfd724e131da992a7c3cb7240) - Still Unstable

Build information: https://ci.FreeBSD.org/job/FreeBSD-main-amd64-test/26465/
Full change log: https://ci.FreeBSD.org/job/FreeBSD-main-amd64-test/26465/changes
Full build log: https://ci.FreeBSD.org/job/FreeBSD-main-amd64-test/26465/console

Status explanation:
"Unstable" - some tests are suspected being broken by the following changes
"Still Unstable" - the failing test cases have not been fixed by these
                   following changes and this is a notification to note that
                   these changes have not been fully tested by the CI system

Change summaries:
(Those commits are likely but not certainly responsible)

9137de9a1b5fdbd77880344820d55e2f05883e53 by kib:
kern_fork.c: style

eba403923626f2ecfd724e131da992a7c3cb7240 by kib:
libc: set close-on-exec for temp socket used to detect IPv6 support



The failed test cases:

5 tests failed.
FAILED:  lib.libexecinfo.sigtramp_test.test_backtrace_sigtramp

Error Message:
/usr/src/lib/libexecinfo/tests/sigtramp_test.c:30: n > 1 not met

FAILED:  sys.kqueue.libkqueue.kqueue_test.main

Error Message:
Received signal 6

FAILED:  lib.libcasper.services.cap_fileargs.fileargs_test.fileargs__open_realpath

Error Message:
/usr/src/lib/libcasper/services/cap_fileargs/tests/fileargs_test.c:733: test_file_open(fa, files[i], &fd) == 0 not met

FAILED:  sys.netinet.broadcast.INADDR_BROADCAST

Error Message:
/usr/src/tests/sys/netinet/broadcast.c:65: sending of broadcast failed: 51

FAILED:  sys.netinet.fibs_test.same_ip_multiple_ifaces_fib0

Error Message:
atf-check failed; see the output of the test for details