FreeBSD-main-amd64-test - Build #26444 - Still Unstable

From: <jenkins-admin_at_FreeBSD.org>
Date: Wed, 21 May 2025 21:34:16 UTC
FreeBSD-main-amd64-test - Build #26444 (c485a58f51608e5473d8580ebd4bf9f4f42fab1a) - Still Unstable

Build information: https://ci.FreeBSD.org/job/FreeBSD-main-amd64-test/26444/
Full change log: https://ci.FreeBSD.org/job/FreeBSD-main-amd64-test/26444/changes
Full build log: https://ci.FreeBSD.org/job/FreeBSD-main-amd64-test/26444/console

Status explanation:
"Unstable" - some tests are suspected being broken by the following changes
"Still Unstable" - the failing test cases have not been fixed by these
                   following changes and this is a notification to note that
                   these changes have not been fully tested by the CI system

Change summaries:
(Those commits are likely but not certainly responsible)

e64fe5ad3a23a9f471ebf11e04e490588913c7af by zlei:
netinet6: Remove a set but not used global variable in6_maxmtu

c485a58f51608e5473d8580ebd4bf9f4f42fab1a by zlei:
UPDATING: Add an entry for the removal of in6_maxmtu



The failed test cases:

4 tests failed.
FAILED:  lib.libcasper.services.cap_fileargs.fileargs_test.fileargs__open_with_casper

Error Message:
/usr/src/lib/libcasper/services/cap_fileargs/tests/fileargs_test.c:443: test_file_open(fa, files[i], &fd) == 0 not met

FAILED:  sys.kqueue.libkqueue.kqueue_test.main

Error Message:
Received signal 6

FAILED:  sys.netinet.broadcast.INADDR_BROADCAST

Error Message:
/usr/src/tests/sys/netinet/broadcast.c:65: sending of broadcast failed: 51

FAILED:  sys.netinet.fibs_test.same_ip_multiple_ifaces_fib0

Error Message:
atf-check failed; see the output of the test for details