FreeBSD-stable-14-amd64-gcc12_build - Build #1677 - Failure
- Go to: [ bottom of page ] [ top of archives ] [ this month ]
Date: Wed, 21 May 2025 10:36:47 UTC
FreeBSD-stable-14-amd64-gcc12_build - Build #1677 (a02915589dffa4b2eb93a686e430b35f7cbb10cc) - Failure
Build information: https://ci.FreeBSD.org/job/FreeBSD-stable-14-amd64-gcc12_build/1677/
Full change log: https://ci.FreeBSD.org/job/FreeBSD-stable-14-amd64-gcc12_build/1677/changes
Full build log: https://ci.FreeBSD.org/job/FreeBSD-stable-14-amd64-gcc12_build/1677/console
Status explanation:
"Failure" - the build is suspected being broken by the following changes
"Still Failing" - the build has not been fixed by the following changes and
this is a notification to note that these changes have
not been fully tested by the CI system
Change summaries:
(Those commits are likely but not certainly responsible)
No changes
The end of the build log:
[...truncated 84.54 MiB...]
/workspace/src/sbin/dhclient/errwarn.c:214:9: note: 'snprintf' output 10 or more bytes (assuming 1033) into a destination of size 1024
214 | snprintf(fbuf, sizeof(fbuf), "%s line %d: %s", tlname, lexline, mbuf);
| ^~~~~~~~~~~~~~~~~~~~~~~~~~~~~~~~~~~~~~~~~~~~~~~~~~~~~~~~~~~~~~~~~~~~~
--- inet.o ---
/usr/local/bin/x86_64-unknown-freebsd14.2-gcc12 --sysroot=/tmp/obj/workspace/src/amd64.amd64/tmp -B/usr/local/x86_64-unknown-freebsd14.2/bin/ -O2 -pipe -fno-common -DRESCUE -I/tmp/obj/workspace/src/amd64.amd64/lib/libifconfig -I/tmp/obj/workspace/src/amd64.amd64/lib/libiscsiutil -MD -MF.depend.inet.o -MTinet.o -std=gnu99 -Wno-format-zero-length -fstack-protector-strong -Wsystem-headers -Werror -Wall -Wno-format-y2k -W -Wno-unused-parameter -Wmissing-prototypes -Wpointer-arith -Wreturn-type -Wcast-qual -Wwrite-strings -Wswitch -Wshadow -Wunused-parameter -Wchar-subscripts -Wnested-externs -Wold-style-definition -Wno-pointer-sign -Wdate-time -Wno-error=address -Wno-error=array-bounds -Wno-error=attributes -Wno-error=bool-compare -Wno-error=cast-align -Wno-error=clobbered -Wno-error=deprecated-declarations -Wno-error=enum-compare -Wno-error=extra -Wno-error=logical-not-parentheses -Wno-error=strict-aliasing -Wno-error=uninitialized -Wno-error=unused-function -Wno-error=unused-value -Wno-error=empty-body -Wno-error=maybe-uninitialized -Wno-error=nonnull-compare -Wno-error=shift-negative-value -Wno-error=tautological-compare -Wno-error=unused-const-variable -Wno-error=bool-operation -Wno-error=deprecated -Wno-error=expansion-to-defined -Wno-error=format-overflow -Wno-error=format-truncation -Wno-error=implicit-fallthrough -Wno-error=int-in-bool-context -Wno-error=memset-elt-size -Wno-error=noexcept-type -Wno-error=nonnull -Wno-error=pointer-compare -Wno-error=stringop-overflow -Wno-error=aggressive-loop-optimizations -Wno-error=cast-function-type -Wno-error=catch-value -Wno-error=multistatement-macros -Wno-error=restrict -Wno-error=sizeof-pointer-memaccess -Wno-error=stringop-truncation -Wno-return-type -c /workspace/src/sbin/dhclient/inet.c -o inet.o
--- all_subdir_tests ---
--- file-attribute-modify ---
--- file-attribute-modify.debug ---
/usr/local/x86_64-unknown-freebsd14.2/bin/objcopy --only-keep-debug file-attribute-modify.full file-attribute-modify.debug
--- all_subdir_sbin ---
--- all_subdir_sbin/pflogd ---
--- privsep_fdpass.pieo ---
/usr/local/bin/x86_64-unknown-freebsd14.2-gcc12 --sysroot=/tmp/obj/workspace/src/amd64.amd64/tmp -B/usr/local/x86_64-unknown-freebsd14.2/bin/ -fpie -DPIC -O2 -pipe -fno-common -include /workspace/src/lib/libpcap/config.h -I/workspace/src/contrib/libpcap -fPIE -g -MD -MF.depend.privsep_fdpass.pieo -MTprivsep_fdpass.pieo -std=gnu99 -Wno-format-zero-length -fstack-protector-strong -Wsystem-headers -Werror -Wall -Wno-format-y2k -Wno-uninitialized -Wno-pointer-sign -Wdate-time -Wno-error=address -Wno-error=array-bounds -Wno-error=attributes -Wno-error=bool-compare -Wno-error=cast-align -Wno-error=clobbered -Wno-error=deprecated-declarations -Wno-error=enum-compare -Wno-error=extra -Wno-error=logical-not-parentheses -Wno-error=strict-aliasing -Wno-error=uninitialized -Wno-error=unused-function -Wno-error=unused-value -Wno-error=empty-body -Wno-error=maybe-uninitialized -Wno-error=nonnull-compare -Wno-error=shift-negative-value -Wno-error=tautological-compare -Wno-error=unused-const-variable -Wno-error=bool-operation -Wno-error=deprecated -Wno-error=expansion-to-defined -Wno-error=format-overflow -Wno-error=format-truncation -Wno-error=implicit-fallthrough -Wno-error=int-in-bool-context -Wno-error=memset-elt-size -Wno-error=noexcept-type -Wno-error=nonnull -Wno-error=pointer-compare -Wno-error=stringop-overflow -Wno-error=aggressive-loop-optimizations -Wno-error=cast-function-type -Wno-error=catch-value -Wno-error=multistatement-macros -Wno-error=restrict -Wno-error=sizeof-pointer-memaccess -Wno-error=stringop-truncation -Wno-return-type -Wno-address-of-packed-member -c /workspace/src/contrib/pf/pflogd/privsep_fdpass.c -o privsep_fdpass.pieo
--- all_subdir_tests ---
--- file-create ---
(cd /workspace/src/tests/sys/audit && DEPENDFILE=.depend.file-create NO_SUBDIR=1 make -f /workspace/src/tests/sys/audit/Makefile _RECURSING_PROGS=t PROG=file-create )
--- file-attribute-modify ---
--- file-attribute-modify ---
/usr/local/x86_64-unknown-freebsd14.2/bin/objcopy --strip-debug --add-gnu-debuglink=file-attribute-modify.debug file-attribute-modify.full file-attribute-modify
--- all_subdir_tests/sys/auditpipe ---
===> tests/sys/auditpipe (all)
--- auditpipe_test ---
--- all_subdir_tests/sys/audit ---
--- file-create ---
--- .depend.file-create ---
--- all_subdir_tests/sys/auditpipe ---
(cd /workspace/src/tests/sys/auditpipe && DEPENDFILE=.depend.auditpipe_test NO_SUBDIR=1 make -f /workspace/src/tests/sys/auditpipe/Makefile _RECURSING_PROGS=t PROG=auditpipe_test )
--- all_subdir_tests/sys/audit ---
echo file-create.full: /tmp/obj/workspace/src/amd64.amd64/tmp/usr/lib/libc.a /tmp/obj/workspace/src/amd64.amd64/tmp/usr/lib/libprivateatf-c.a >> .depend.file-create
--- file-create.o ---
/usr/local/bin/x86_64-unknown-freebsd14.2-gcc12 --sysroot=/tmp/obj/workspace/src/amd64.amd64/tmp -B/usr/local/x86_64-unknown-freebsd14.2/bin/ -O2 -pipe -fno-common -I/workspace/src/contrib/openbsm -g -MD -MF.depend.file-create.file-create.o -MTfile-create.o -std=gnu99 -Wno-format-zero-length -fstack-protector-strong -Wsystem-headers -Werror -Wall -Wno-format-y2k -W -Wno-unused-parameter -Wmissing-prototypes -Wpointer-arith -Wreturn-type -Wcast-qual -Wwrite-strings -Wswitch -Wshadow -Wunused-parameter -Wcast-align -Wchar-subscripts -Wnested-externs -Wold-style-definition -Wno-pointer-sign -Wdate-time -Wno-error=address -Wno-error=array-bounds -Wno-error=attributes -Wno-error=bool-compare -Wno-error=cast-align -Wno-error=clobbered -Wno-error=deprecated-declarations -Wno-error=enum-compare -Wno-error=extra -Wno-error=logical-not-parentheses -Wno-error=strict-aliasing -Wno-error=uninitialized -Wno-error=unused-function -Wno-error=unused-value -Wno-error=empty-body -Wno-error=maybe-uninitialized -Wno-error=nonnull-compare -Wno-error=shift-negative-value -Wno-error=tautological-compare -Wno-error=unused-const-variable -Wno-error=bool-operation -Wno-error=deprecated -Wno-error=expansion-to-defined -Wno-error=format-overflow -Wno-error=format-truncation -Wno-error=implicit-fallthrough -Wno-error=int-in-bool-context -Wno-error=memset-elt-size -Wno-error=noexcept-type -Wno-error=nonnull -Wno-error=pointer-compare -Wno-error=stringop-overflow -Wno-error=aggressive-loop-optimizations -Wno-error=cast-function-type -Wno-error=catch-value -Wno-error=multistatement-macros -Wno-error=restrict -Wno-error=sizeof-pointer-memaccess -Wno-error=stringop-truncation -Wno-return-type -c /workspace/src/tests/sys/audit/file-create.c -o file-create.o
--- all_subdir_tests/sys/auditpipe ---
--- .depend.auditpipe_test ---
echo auditpipe_test.full: /tmp/obj/workspace/src/amd64.amd64/tmp/usr/lib/libc.a /tmp/obj/workspace/src/amd64.amd64/tmp/usr/lib/libprivateatf-c.a >> .depend.auditpipe_test
--- auditpipe_test.pieo ---
/usr/local/bin/x86_64-unknown-freebsd14.2-gcc12 --sysroot=/tmp/obj/workspace/src/amd64.amd64/tmp -B/usr/local/x86_64-unknown-freebsd14.2/bin/ -fpie -DPIC -O2 -pipe -fno-common -fPIE -g -MD -MF.depend.auditpipe_test.auditpipe_test.pieo -MTauditpipe_test.pieo -std=gnu99 -Wno-format-zero-length -fstack-protector-strong -Wsystem-headers -Werror -Wall -Wno-format-y2k -W -Wno-unused-parameter -Wmissing-prototypes -Wpointer-arith -Wreturn-type -Wcast-qual -Wwrite-strings -Wswitch -Wshadow -Wunused-parameter -Wcast-align -Wchar-subscripts -Wnested-externs -Wold-style-definition -Wno-pointer-sign -Wdate-time -Wno-error=address -Wno-error=array-bounds -Wno-error=attributes -Wno-error=bool-compare -Wno-error=cast-align -Wno-error=clobbered -Wno-error=deprecated-declarations -Wno-error=enum-compare -Wno-error=extra -Wno-error=logical-not-parentheses -Wno-error=strict-aliasing -Wno-error=uninitialized -Wno-error=unused-function -Wno-error=unused-value -Wno-error=empty-body -Wno-error=maybe-uninitialized -Wno-error=nonnull-compare -Wno-error=shift-negative-value -Wno-error=tautological-compare -Wno-error=unused-const-variable -Wno-error=bool-operation -Wno-error=deprecated -Wno-error=expansion-to-defined -Wno-error=format-overflow -Wno-error=format-truncation -Wno-error=implicit-fallthrough -Wno-error=int-in-bool-context -Wno-error=memset-elt-size -Wno-error=noexcept-type -Wno-error=nonnull -Wno-error=pointer-compare -Wno-error=stringop-overflow -Wno-error=aggressive-loop-optimizations -Wno-error=cast-function-type -Wno-error=catch-value -Wno-error=multistatement-macros -Wno-error=restrict -Wno-error=sizeof-pointer-memaccess -Wno-error=stringop-truncation -Wno-return-type -c /workspace/src/tests/sys/auditpipe/auditpipe_test.c -o auditpipe_test.pieo
--- all_subdir_rescue ---
--- packet.o ---
/usr/local/bin/x86_64-unknown-freebsd14.2-gcc12 --sysroot=/tmp/obj/workspace/src/amd64.amd64/tmp -B/usr/local/x86_64-unknown-freebsd14.2/bin/ -O2 -pipe -fno-common -DRESCUE -I/tmp/obj/workspace/src/amd64.amd64/lib/libifconfig -I/tmp/obj/workspace/src/amd64.amd64/lib/libiscsiutil -MD -MF.depend.packet.o -MTpacket.o -std=gnu99 -Wno-format-zero-length -fstack-protector-strong -Wsystem-headers -Werror -Wall -Wno-format-y2k -W -Wno-unused-parameter -Wmissing-prototypes -Wpointer-arith -Wreturn-type -Wcast-qual -Wwrite-strings -Wswitch -Wshadow -Wunused-parameter -Wchar-subscripts -Wnested-externs -Wold-style-definition -Wno-pointer-sign -Wdate-time -Wno-error=address -Wno-error=array-bounds -Wno-error=attributes -Wno-error=bool-compare -Wno-error=cast-align -Wno-error=clobbered -Wno-error=deprecated-declarations -Wno-error=enum-compare -Wno-error=extra -Wno-error=logical-not-parentheses -Wno-error=strict-aliasing -Wno-error=uninitialized -Wno-error=unused-function -Wno-error=unused-value -Wno-error=empty-body -Wno-error=maybe-uninitialized -Wno-error=nonnull-compare -Wno-error=shift-negative-value -Wno-error=tautological-compare -Wno-error=unused-const-variable -Wno-error=bool-operation -Wno-error=deprecated -Wno-error=expansion-to-defined -Wno-error=format-overflow -Wno-error=format-truncation -Wno-error=implicit-fallthrough -Wno-error=int-in-bool-context -Wno-error=memset-elt-size -Wno-error=noexcept-type -Wno-error=nonnull -Wno-error=pointer-compare -Wno-error=stringop-overflow -Wno-error=aggressive-loop-optimizations -Wno-error=cast-function-type -Wno-error=catch-value -Wno-error=multistatement-macros -Wno-error=restrict -Wno-error=sizeof-pointer-memaccess -Wno-error=stringop-truncation -Wno-return-type -c /workspace/src/sbin/dhclient/packet.c -o packet.o
--- all_subdir_sbin ---
--- pflogd.full ---
/usr/local/bin/x86_64-unknown-freebsd14.2-gcc12 --sysroot=/tmp/obj/workspace/src/amd64.amd64/tmp -B/usr/local/x86_64-unknown-freebsd14.2/bin/ -O2 -pipe -fno-common -include /workspace/src/lib/libpcap/config.h -I/workspace/src/contrib/libpcap -fPIE -g -std=gnu99 -Wno-format-zero-length -fstack-protector-strong -Wsystem-headers -Werror -Wall -Wno-format-y2k -Wno-uninitialized -Wno-pointer-sign -Wdate-time -Wno-error=address -Wno-error=array-bounds -Wno-error=attributes -Wno-error=bool-compare -Wno-error=cast-align -Wno-error=clobbered -Wno-error=deprecated-declarations -Wno-error=enum-compare -Wno-error=extra -Wno-error=logical-not-parentheses -Wno-error=strict-aliasing -Wno-error=uninitialized -Wno-error=unused-function -Wno-error=unused-value -Wno-error=empty-body -Wno-error=maybe-uninitialized -Wno-error=nonnull-compare -Wno-error=shift-negative-value -Wno-error=tautological-compare -Wno-error=unused-const-variable -Wno-error=bool-operation -Wno-error=deprecated -Wno-error=expansion-to-defined -Wno-error=format-overflow -Wno-error=format-truncation -Wno-error=implicit-fallthrough -Wno-error=int-in-bool-context -Wno-error=memset-elt-size -Wno-error=noexcept-type -Wno-error=nonnull -Wno-error=pointer-compare -Wno-error=stringop-overflow -Wno-error=aggressive-loop-optimizations -Wno-error=cast-function-type -Wno-error=catch-value -Wno-error=multistatement-macros -Wno-error=restrict -Wno-error=sizeof-pointer-memaccess -Wno-error=stringop-truncation -Wno-return-type -Wno-address-of-packed-member -Wl,-zrelro -pie -Wl,-znoexecstack -o pflogd.full pflogd.pieo pidfile.pieo privsep.pieo privsep_fdpass.pieo -lpcap
--- pflogd.8.gz ---
gzip -cn /workspace/src/contrib/pf/pflogd/pflogd.8 > pflogd.8.gz
--- pflogd.debug ---
/usr/local/x86_64-unknown-freebsd14.2/bin/objcopy --only-keep-debug pflogd.full pflogd.debug
--- pflogd ---
/usr/local/x86_64-unknown-freebsd14.2/bin/objcopy --strip-debug --add-gnu-debuglink=pflogd.debug pflogd.full pflogd
--- all_subdir_rescue ---
--- sed_make ---
(cd /workspace/src/rescue/rescue/../../usr.bin/sed && make MK_PIE=no NO_SHARED=yes -DRESCUE CRUNCH_CFLAGS=-DRESCUE CRUNCH_CFLAGS+=-I/tmp/obj/workspace/src/amd64.amd64/lib/libifconfig CRUNCH_CFLAGS+=-I/tmp/obj/workspace/src/amd64.amd64/lib/libiscsiutil MK_AUTO_OBJ=yes DIRPRFX=rescue/rescue/sed/ depend && make MK_PIE=no NO_SHARED=yes -DRESCUE CRUNCH_CFLAGS=-DRESCUE CRUNCH_CFLAGS+=-I/tmp/obj/workspace/src/amd64.amd64/lib/libifconfig CRUNCH_CFLAGS+=-I/tmp/obj/workspace/src/amd64.amd64/lib/libiscsiutil MK_AUTO_OBJ=yes DIRPRFX=rescue/rescue/sed/ compile.o main.o misc.o process.o)
--- .depend ---
echo sed.full: /tmp/obj/workspace/src/amd64.amd64/tmp/usr/lib/libc.a >> .depend
--- compile.o ---
/usr/local/bin/x86_64-unknown-freebsd14.2-gcc12 --sysroot=/tmp/obj/workspace/src/amd64.amd64/tmp -B/usr/local/x86_64-unknown-freebsd14.2/bin/ -O2 -pipe -fno-common -DRESCUE -I/tmp/obj/workspace/src/amd64.amd64/lib/libifconfig -I/tmp/obj/workspace/src/amd64.amd64/lib/libiscsiutil -MD -MF.depend.compile.o -MTcompile.o -std=gnu99 -Wno-format-zero-length -fstack-protector-strong -Wsystem-headers -Werror -Wall -Wno-format-y2k -W -Wno-unused-parameter -Wmissing-prototypes -Wpointer-arith -Wreturn-type -Wcast-qual -Wwrite-strings -Wswitch -Wshadow -Wunused-parameter -Wcast-align -Wchar-subscripts -Wnested-externs -Wold-style-definition -Wno-pointer-sign -Wdate-time -Wno-error=address -Wno-error=array-bounds -Wno-error=attributes -Wno-error=bool-compare -Wno-error=cast-align -Wno-error=clobbered -Wno-error=deprecated-declarations -Wno-error=enum-compare -Wno-error=extra -Wno-error=logical-not-parentheses -Wno-error=strict-aliasing -Wno-error=uninitialized -Wno-error=unused-function -Wno-error=unused-value -Wno-error=empty-body -Wno-error=maybe-uninitialized -Wno-error=nonnull-compare -Wno-error=shift-negative-value -Wno-error=tautological-compare -Wno-error=unused-const-variable -Wno-error=bool-operation -Wno-error=deprecated -Wno-error=expansion-to-defined -Wno-error=format-overflow -Wno-error=format-truncation -Wno-error=implicit-fallthrough -Wno-error=int-in-bool-context -Wno-error=memset-elt-size -Wno-error=noexcept-type -Wno-error=nonnull -Wno-error=pointer-compare -Wno-error=stringop-overflow -Wno-error=aggressive-loop-optimizations -Wno-error=cast-function-type -Wno-error=catch-value -Wno-error=multistatement-macros -Wno-error=restrict -Wno-error=sizeof-pointer-memaccess -Wno-error=stringop-truncation -Wno-return-type -c /workspace/src/usr.bin/sed/compile.c -o compile.o
--- main.o ---
/usr/local/bin/x86_64-unknown-freebsd14.2-gcc12 --sysroot=/tmp/obj/workspace/src/amd64.amd64/tmp -B/usr/local/x86_64-unknown-freebsd14.2/bin/ -O2 -pipe -fno-common -DRESCUE -I/tmp/obj/workspace/src/amd64.amd64/lib/libifconfig -I/tmp/obj/workspace/src/amd64.amd64/lib/libiscsiutil -MD -MF.depend.main.o -MTmain.o -std=gnu99 -Wno-format-zero-length -fstack-protector-strong -Wsystem-headers -Werror -Wall -Wno-format-y2k -W -Wno-unused-parameter -Wmissing-prototypes -Wpointer-arith -Wreturn-type -Wcast-qual -Wwrite-strings -Wswitch -Wshadow -Wunused-parameter -Wcast-align -Wchar-subscripts -Wnested-externs -Wold-style-definition -Wno-pointer-sign -Wdate-time -Wno-error=address -Wno-error=array-bounds -Wno-error=attributes -Wno-error=bool-compare -Wno-error=cast-align -Wno-error=clobbered -Wno-error=deprecated-declarations -Wno-error=enum-compare -Wno-error=extra -Wno-error=logical-not-parentheses -Wno-error=strict-aliasing -Wno-error=uninitialized -Wno-error=unused-function -Wno-error=unused-value -Wno-error=empty-body -Wno-error=maybe-uninitialized -Wno-error=nonnull-compare -Wno-error=shift-negative-value -Wno-error=tautological-compare -Wno-error=unused-const-variable -Wno-error=bool-operation -Wno-error=deprecated -Wno-error=expansion-to-defined -Wno-error=format-overflow -Wno-error=format-truncation -Wno-error=implicit-fallthrough -Wno-error=int-in-bool-context -Wno-error=memset-elt-size -Wno-error=noexcept-type -Wno-error=nonnull -Wno-error=pointer-compare -Wno-error=stringop-overflow -Wno-error=aggressive-loop-optimizations -Wno-error=cast-function-type -Wno-error=catch-value -Wno-error=multistatement-macros -Wno-error=restrict -Wno-error=sizeof-pointer-memaccess -Wno-error=stringop-truncation -Wno-return-type -c /workspace/src/usr.bin/sed/main.c -o main.o
--- dhclient_make ---
--- convert.o ---
/usr/local/bin/x86_64-unknown-freebsd14.2-gcc12 --sysroot=/tmp/obj/workspace/src/amd64.amd64/tmp -B/usr/local/x86_64-unknown-freebsd14.2/bin/ -O2 -pipe -fno-common -DRESCUE -I/tmp/obj/workspace/src/amd64.amd64/lib/libifconfig -I/tmp/obj/workspace/src/amd64.amd64/lib/libiscsiutil -MD -MF.depend.convert.o -MTconvert.o -std=gnu99 -Wno-format-zero-length -fstack-protector-strong -Wsystem-headers -Werror -Wall -Wno-format-y2k -W -Wno-unused-parameter -Wmissing-prototypes -Wpointer-arith -Wreturn-type -Wcast-qual -Wwrite-strings -Wswitch -Wshadow -Wunused-parameter -Wchar-subscripts -Wnested-externs -Wold-style-definition -Wno-pointer-sign -Wdate-time -Wno-error=address -Wno-error=array-bounds -Wno-error=attributes -Wno-error=bool-compare -Wno-error=cast-align -Wno-error=clobbered -Wno-error=deprecated-declarations -Wno-error=enum-compare -Wno-error=extra -Wno-error=logical-not-parentheses -Wno-error=strict-aliasing -Wno-error=uninitialized -Wno-error=unused-function -Wno-error=unused-value -Wno-error=empty-body -Wno-error=maybe-uninitialized -Wno-error=nonnull-compare -Wno-error=shift-negative-value -Wno-error=tautological-compare -Wno-error=unused-const-variable -Wno-error=bool-operation -Wno-error=deprecated -Wno-error=expansion-to-defined -Wno-error=format-overflow -Wno-error=format-truncation -Wno-error=implicit-fallthrough -Wno-error=int-in-bool-context -Wno-error=memset-elt-size -Wno-error=noexcept-type -Wno-error=nonnull -Wno-error=pointer-compare -Wno-error=stringop-overflow -Wno-error=aggressive-loop-optimizations -Wno-error=cast-function-type -Wno-error=catch-value -Wno-error=multistatement-macros -Wno-error=restrict -Wno-error=sizeof-pointer-memaccess -Wno-error=stringop-truncation -Wno-return-type -c /workspace/src/sbin/dhclient/convert.c -o convert.o
--- sed_make ---
--- compile.o ---
/workspace/src/usr.bin/sed/compile.c:38:19: warning: 'sccsid' defined but not used [-Wunused-const-variable=]
38 | static const char sccsid[] = "@(#)compile.c 8.1 (Berkeley) 6/6/93";
| ^~~~~~
--- main.o ---
In file included from /workspace/src/usr.bin/sed/main.c:37:
/workspace/src/usr.bin/sed/main.c: In function 'mf_fgets':
/workspace/src/usr.bin/sed/main.c:423:44: warning: left-hand operand of comma expression has no effect [-Wunused-value]
423 | "%s/.!%ld!%s", dirname(dirbuf), (long)getpid(),
| ^~~~~~~
/workspace/src/usr.bin/sed/main.c:424:29: warning: left-hand operand of comma expression has no effect [-Wunused-value]
424 | basename(basebuf));
| ^~~~~~~~
/workspace/src/usr.bin/sed/main.c: At top level:
/workspace/src/usr.bin/sed/main.c:45:19: warning: 'sccsid' defined but not used [-Wunused-const-variable=]
45 | static const char sccsid[] = "@(#)main.c 8.2 (Berkeley) 1/3/94";
| ^~~~~~
/workspace/src/usr.bin/sed/main.c:39:19: warning: 'copyright' defined but not used [-Wunused-const-variable=]
39 | static const char copyright[] =
| ^~~~~~~~~
--- all_subdir_tests ---
--- auditpipe_test.full ---
/usr/local/bin/x86_64-unknown-freebsd14.2-gcc12 --sysroot=/tmp/obj/workspace/src/amd64.amd64/tmp -B/usr/local/x86_64-unknown-freebsd14.2/bin/ -O2 -pipe -fno-common -fPIE -g -std=gnu99 -Wno-format-zero-length -fstack-protector-strong -Wsystem-headers -Werror -Wall -Wno-format-y2k -W -Wno-unused-parameter -Wmissing-prototypes -Wpointer-arith -Wreturn-type -Wcast-qual -Wwrite-strings -Wswitch -Wshadow -Wunused-parameter -Wcast-align -Wchar-subscripts -Wnested-externs -Wold-style-definition -Wno-pointer-sign -Wdate-time -Wno-error=address -Wno-error=array-bounds -Wno-error=attributes -Wno-error=bool-compare -Wno-error=cast-align -Wno-error=clobbered -Wno-error=deprecated-declarations -Wno-error=enum-compare -Wno-error=extra -Wno-error=logical-not-parentheses -Wno-error=strict-aliasing -Wno-error=uninitialized -Wno-error=unused-function -Wno-error=unused-value -Wno-error=empty-body -Wno-error=maybe-uninitialized -Wno-error=nonnull-compare -Wno-error=shift-negative-value -Wno-error=tautological-compare -Wno-error=unused-const-variable -Wno-error=bool-operation -Wno-error=deprecated -Wno-error=expansion-to-defined -Wno-error=format-overflow -Wno-error=format-truncation -Wno-error=implicit-fallthrough -Wno-error=int-in-bool-context -Wno-error=memset-elt-size -Wno-error=noexcept-type -Wno-error=nonnull -Wno-error=pointer-compare -Wno-error=stringop-overflow -Wno-error=aggressive-loop-optimizations -Wno-error=cast-function-type -Wno-error=catch-value -Wno-error=multistatement-macros -Wno-error=restrict -Wno-error=sizeof-pointer-memaccess -Wno-error=stringop-truncation -Wno-return-type -Wl,-zrelro -pie -Wl,-znoexecstack -o auditpipe_test.full auditpipe_test.pieo -lprivateatf-c
--- auditpipe_test.debug ---
/usr/local/x86_64-unknown-freebsd14.2/bin/objcopy --only-keep-debug auditpipe_test.full auditpipe_test.debug
--- auditpipe_test ---
/usr/local/x86_64-unknown-freebsd14.2/bin/objcopy --strip-debug --add-gnu-debuglink=auditpipe_test.debug auditpipe_test.full auditpipe_test
--- Kyuafile ---
--- all_subdir_rescue ---
--- dhclient_make ---
--- tables.o ---
/usr/local/bin/x86_64-unknown-freebsd14.2-gcc12 --sysroot=/tmp/obj/workspace/src/amd64.amd64/tmp -B/usr/local/x86_64-unknown-freebsd14.2/bin/ -O2 -pipe -fno-common -DRESCUE -I/tmp/obj/workspace/src/amd64.amd64/lib/libifconfig -I/tmp/obj/workspace/src/amd64.amd64/lib/libiscsiutil -MD -MF.depend.tables.o -MTtables.o -std=gnu99 -Wno-format-zero-length -fstack-protector-strong -Wsystem-headers -Werror -Wall -Wno-format-y2k -W -Wno-unused-parameter -Wmissing-prototypes -Wpointer-arith -Wreturn-type -Wcast-qual -Wwrite-strings -Wswitch -Wshadow -Wunused-parameter -Wchar-subscripts -Wnested-externs -Wold-style-definition -Wno-pointer-sign -Wdate-time -Wno-error=address -Wno-error=array-bounds -Wno-error=attributes -Wno-error=bool-compare -Wno-error=cast-align -Wno-error=clobbered -Wno-error=deprecated-declarations -Wno-error=enum-compare -Wno-error=extra -Wno-error=logical-not-parentheses -Wno-error=strict-aliasing -Wno-error=uninitialized -Wno-error=unused-function -Wno-error=unused-value -Wno-error=empty-body -Wno-error=maybe-uninitialized -Wno-error=nonnull-compare -Wno-error=shift-negative-value -Wno-error=tautological-compare -Wno-error=unused-const-variable -Wno-error=bool-operation -Wno-error=deprecated -Wno-error=expansion-to-defined -Wno-error=format-overflow -Wno-error=format-truncation -Wno-error=implicit-fallthrough -Wno-error=int-in-bool-context -Wno-error=memset-elt-size -Wno-error=noexcept-type -Wno-error=nonnull -Wno-error=pointer-compare -Wno-error=stringop-overflow -Wno-error=aggressive-loop-optimizations -Wno-error=cast-function-type -Wno-error=catch-value -Wno-error=multistatement-macros -Wno-error=restrict -Wno-error=sizeof-pointer-memaccess -Wno-error=stringop-truncation -Wno-return-type -c /workspace/src/sbin/dhclient/tables.c -o tables.o
--- all_subdir_tests ---
--- all_subdir_tests/sys/cam ---
===> tests/sys/cam (all)
--- all_subdir_tests/sys/audit ---
--- file-create.full ---
/usr/local/bin/x86_64-unknown-freebsd14.2-gcc12 --sysroot=/tmp/obj/workspace/src/amd64.amd64/tmp -B/usr/local/x86_64-unknown-freebsd14.2/bin/ -O2 -pipe -fno-common -I/workspace/src/contrib/openbsm -g -std=gnu99 -Wno-format-zero-length -fstack-protector-strong -Wsystem-headers -Werror -Wall -Wno-format-y2k -W -Wno-unused-parameter -Wmissing-prototypes -Wpointer-arith -Wreturn-type -Wcast-qual -Wwrite-strings -Wswitch -Wshadow -Wunused-parameter -Wcast-align -Wchar-subscripts -Wnested-externs -Wold-style-definition -Wno-pointer-sign -Wdate-time -Wno-error=address -Wno-error=array-bounds -Wno-error=attributes -Wno-error=bool-compare -Wno-error=cast-align -Wno-error=clobbered -Wno-error=deprecated-declarations -Wno-error=enum-compare -Wno-error=extra -Wno-error=logical-not-parentheses -Wno-error=strict-aliasing -Wno-error=uninitialized -Wno-error=unused-function -Wno-error=unused-value -Wno-error=empty-body -Wno-error=maybe-uninitialized -Wno-error=nonnull-compare -Wno-error=shift-negative-value -Wno-error=tautological-compare -Wno-error=unused-const-variable -Wno-error=bool-operation -Wno-error=deprecated -Wno-error=expansion-to-defined -Wno-error=format-overflow -Wno-error=format-truncation -Wno-error=implicit-fallthrough -Wno-error=int-in-bool-context -Wno-error=memset-elt-size -Wno-error=noexcept-type -Wno-error=nonnull -Wno-error=pointer-compare -Wno-error=stringop-overflow -Wno-error=aggressive-loop-optimizations -Wno-error=cast-function-type -Wno-error=catch-value -Wno-error=multistatement-macros -Wno-error=restrict -Wno-error=sizeof-pointer-memaccess -Wno-error=stringop-truncation -Wno-return-type -lbsm -lutil -Wl,-zrelro -Wl,-znoexecstack -o file-create.full file-create.o utils.o /tmp/obj/workspace/src/amd64.amd64/tmp/usr/lib/libprivateauditd.a -lprivateatf-c
--- all_subdir_tests/sys/cam ---
--- all_subdir_tests/sys/cam/ctl ---
===> tests/sys/cam/ctl (all)
--- prevent ---
echo '#! /usr/libexec/atf-sh' > prevent.tmp
cat /workspace/src/tests/sys/cam/ctl/prevent.sh >>prevent.tmp
chmod +x prevent.tmp
mv prevent.tmp prevent
--- read_buffer ---
echo '#! /usr/libexec/atf-sh' > read_buffer.tmp
cat /workspace/src/tests/sys/cam/ctl/read_buffer.sh >>read_buffer.tmp
chmod +x read_buffer.tmp
mv read_buffer.tmp read_buffer
--- start_stop_unit ---
echo '#! /usr/libexec/atf-sh' > start_stop_unit.tmp
cat /workspace/src/tests/sys/cam/ctl/start_stop_unit.sh >>start_stop_unit.tmp
chmod +x start_stop_unit.tmp
mv start_stop_unit.tmp start_stop_unit
--- Kyuafile ---
--- all_subdir_tests/sys/audit ---
--- file-create.debug ---
--- all_subdir_tests/sys/cam ---
--- Kyuafile ---
--- all_subdir_tests/sys/audit ---
/usr/local/x86_64-unknown-freebsd14.2/bin/objcopy --only-keep-debug file-create.full file-create.debug
--- file-delete ---
(cd /workspace/src/tests/sys/audit && DEPENDFILE=.depend.file-delete NO_SUBDIR=1 make -f /workspace/src/tests/sys/audit/Makefile _RECURSING_PROGS=t PROG=file-delete )
--- file-create ---
--- file-create ---
/usr/local/x86_64-unknown-freebsd14.2/bin/objcopy --strip-debug --add-gnu-debuglink=file-create.debug file-create.full file-create
--- all_subdir_rescue ---
--- parse.o ---
/usr/local/bin/x86_64-unknown-freebsd14.2-gcc12 --sysroot=/tmp/obj/workspace/src/amd64.amd64/tmp -B/usr/local/x86_64-unknown-freebsd14.2/bin/ -O2 -pipe -fno-common -DRESCUE -I/tmp/obj/workspace/src/amd64.amd64/lib/libifconfig -I/tmp/obj/workspace/src/amd64.amd64/lib/libiscsiutil -MD -MF.depend.parse.o -MTparse.o -std=gnu99 -Wno-format-zero-length -fstack-protector-strong -Wsystem-headers -Werror -Wall -Wno-format-y2k -W -Wno-unused-parameter -Wmissing-prototypes -Wpointer-arith -Wreturn-type -Wcast-qual -Wwrite-strings -Wswitch -Wshadow -Wunused-parameter -Wchar-subscripts -Wnested-externs -Wold-style-definition -Wno-pointer-sign -Wdate-time -Wno-error=address -Wno-error=array-bounds -Wno-error=attributes -Wno-error=bool-compare -Wno-error=cast-align -Wno-error=clobbered -Wno-error=deprecated-declarations -Wno-error=enum-compare -Wno-error=extra -Wno-error=logical-not-parentheses -Wno-error=strict-aliasing -Wno-error=uninitialized -Wno-error=unused-function -Wno-error=unused-value -Wno-error=empty-body -Wno-error=maybe-uninitialized -Wno-error=nonnull-compare -Wno-error=shift-negative-value -Wno-error=tautological-compare -Wno-error=unused-const-variable -Wno-error=bool-operation -Wno-error=deprecated -Wno-error=expansion-to-defined -Wno-error=format-overflow -Wno-error=format-truncation -Wno-error=implicit-fallthrough -Wno-error=int-in-bool-context -Wno-error=memset-elt-size -Wno-error=noexcept-type -Wno-error=nonnull -Wno-error=pointer-compare -Wno-error=stringop-overflow -Wno-error=aggressive-loop-optimizations -Wno-error=cast-function-type -Wno-error=catch-value -Wno-error=multistatement-macros -Wno-error=restrict -Wno-error=sizeof-pointer-memaccess -Wno-error=stringop-truncation -Wno-return-type -c /workspace/src/sbin/dhclient/parse.c -o parse.o
--- all_subdir_tests ---
--- file-delete ---
--- .depend.file-delete ---
echo file-delete.full: /tmp/obj/workspace/src/amd64.amd64/tmp/usr/lib/libc.a /tmp/obj/workspace/src/amd64.amd64/tmp/usr/lib/libprivateatf-c.a >> .depend.file-delete
--- file-delete.o ---
/usr/local/bin/x86_64-unknown-freebsd14.2-gcc12 --sysroot=/tmp/obj/workspace/src/amd64.amd64/tmp -B/usr/local/x86_64-unknown-freebsd14.2/bin/ -O2 -pipe -fno-common -I/workspace/src/contrib/openbsm -g -MD -MF.depend.file-delete.file-delete.o -MTfile-delete.o -std=gnu99 -Wno-format-zero-length -fstack-protector-strong -Wsystem-headers -Werror -Wall -Wno-format-y2k -W -Wno-unused-parameter -Wmissing-prototypes -Wpointer-arith -Wreturn-type -Wcast-qual -Wwrite-strings -Wswitch -Wshadow -Wunused-parameter -Wcast-align -Wchar-subscripts -Wnested-externs -Wold-style-definition -Wno-pointer-sign -Wdate-time -Wno-error=address -Wno-error=array-bounds -Wno-error=attributes -Wno-error=bool-compare -Wno-error=cast-align -Wno-error=clobbered -Wno-error=deprecated-declarations -Wno-error=enum-compare -Wno-error=extra -Wno-error=logical-not-parentheses -Wno-error=strict-aliasing -Wno-error=uninitialized -Wno-error=unused-function -Wno-error=unused-value -Wno-error=empty-body -Wno-error=maybe-uninitialized -Wno-error=nonnull-compare -Wno-error=shift-negative-value -Wno-error=tautological-compare -Wno-error=unused-const-variable -Wno-error=bool-operation -Wno-error=deprecated -Wno-error=expansion-to-defined -Wno-error=format-overflow -Wno-error=format-truncation -Wno-error=implicit-fallthrough -Wno-error=int-in-bool-context -Wno-error=memset-elt-size -Wno-error=noexcept-type -Wno-error=nonnull -Wno-error=pointer-compare -Wno-error=stringop-overflow -Wno-error=aggressive-loop-optimizations -Wno-error=cast-function-type -Wno-error=catch-value -Wno-error=multistatement-macros -Wno-error=restrict -Wno-error=sizeof-pointer-memaccess -Wno-error=stringop-truncation -Wno-return-type -c /workspace/src/tests/sys/audit/file-delete.c -o file-delete.o
--- all_subdir_tests/sys/capsicum ---
===> tests/sys/capsicum (all)
--- mini-me.pieo ---
/usr/local/bin/x86_64-unknown-freebsd14.2-gcc12 --sysroot=/tmp/obj/workspace/src/amd64.amd64/tmp -B/usr/local/x86_64-unknown-freebsd14.2/bin/ -fpie -DPIC -O2 -pipe -fno-common -I/workspace/src/tests -fPIE -g -std=gnu99 -Wno-format-zero-length -fstack-protector-strong -Wsystem-headers -Werror -Wall -Wno-format-y2k -W -Wno-unused-parameter -Wmissing-prototypes -Wpointer-arith -Wreturn-type -Wcast-qual -Wwrite-strings -Wswitch -Wshadow -Wunused-parameter -Wcast-align -Wchar-subscripts -Wnested-externs -Wold-style-definition -Wno-pointer-sign -Wdate-time -Wno-error=address -Wno-error=array-bounds -Wno-error=attributes -Wno-error=bool-compare -Wno-error=cast-align -Wno-error=clobbered -Wno-error=deprecated-declarations -Wno-error=enum-compare -Wno-error=extra -Wno-error=logical-not-parentheses -Wno-error=strict-aliasing -Wno-error=uninitialized -Wno-error=unused-function -Wno-error=unused-value -Wno-error=empty-body -Wno-error=maybe-uninitialized -Wno-error=nonnull-compare -Wno-error=shift-negative-value -Wno-error=tautological-compare -Wno-error=unused-const-variable -Wno-error=bool-operation -Wno-error=deprecated -Wno-error=expansion-to-defined -Wno-error=format-overflow -Wno-error=format-truncation -Wno-error=implicit-fallthrough -Wno-error=int-in-bool-context -Wno-error=memset-elt-size -Wno-error=noexcept-type -Wno-error=nonnull -Wno-error=pointer-compare -Wno-error=stringop-overflow -Wno-error=aggressive-loop-optimizations -Wno-error=cast-function-type -Wno-error=catch-value -Wno-error=multistatement-macros -Wno-error=restrict -Wno-error=sizeof-pointer-memaccess -Wno-error=stringop-truncation -Wno-return-type -c /workspace/src/contrib/capsicum-test/mini-me.c -o mini-me.pieo
--- functional ---
echo '#! /usr/libexec/atf-sh' > functional.tmp
cat /workspace/src/tests/sys/capsicum/functional.sh >>functional.tmp
chmod +x functional.tmp
mv functional.tmp functional
--- Kyuafile ---
--- mini-me ---
(cd /workspace/src/tests/sys/capsicum && DEPENDFILE=.depend.mini-me NO_SUBDIR=1 make -f /workspace/src/tests/sys/capsicum/Makefile _RECURSING_PROGS=t PROG=mini-me )
--- .depend.mini-me ---
echo mini-me.full: /tmp/obj/workspace/src/amd64.amd64/tmp/usr/lib/libc.a >> .depend.mini-me
--- mini-me.o ---
/usr/local/bin/x86_64-unknown-freebsd14.2-gcc12 --sysroot=/tmp/obj/workspace/src/amd64.amd64/tmp -B/usr/local/x86_64-unknown-freebsd14.2/bin/ -O2 -pipe -fno-common -I/workspace/src/tests -g -MD -MF.depend.mini-me.mini-me.o -MTmini-me.o -std=gnu99 -Wno-format-zero-length -fstack-protector-strong -Wsystem-headers -Werror -Wall -Wno-format-y2k -W -Wno-unused-parameter -Wmissing-prototypes -Wpointer-arith -Wreturn-type -Wcast-qual -Wwrite-strings -Wswitch -Wshadow -Wunused-parameter -Wcast-align -Wchar-subscripts -Wnested-externs -Wold-style-definition -Wno-pointer-sign -Wdate-time -Wno-error=address -Wno-error=array-bounds -Wno-error=attributes -Wno-error=bool-compare -Wno-error=cast-align -Wno-error=clobbered -Wno-error=deprecated-declarations -Wno-error=enum-compare -Wno-error=extra -Wno-error=logical-not-parentheses -Wno-error=strict-aliasing -Wno-error=uninitialized -Wno-error=unused-function -Wno-error=unused-value -Wno-error=empty-body -Wno-error=maybe-uninitialized -Wno-error=nonnull-compare -Wno-error=shift-negative-value -Wno-error=tautological-compare -Wno-error=unused-const-variable -Wno-error=bool-operation -Wno-error=deprecated -Wno-error=expansion-to-defined -Wno-error=format-overflow -Wno-error=format-truncation -Wno-error=implicit-fallthrough -Wno-error=int-in-bool-context -Wno-error=memset-elt-size -Wno-error=noexcept-type -Wno-error=nonnull -Wno-error=pointer-compare -Wno-error=stringop-overflow -Wno-error=aggressive-loop-optimizations -Wno-error=cast-function-type -Wno-error=catch-value -Wno-error=multistatement-macros -Wno-error=restrict -Wno-error=sizeof-pointer-memaccess -Wno-error=stringop-truncation -Wno-return-type -c /workspace/src/contrib/capsicum-test/mini-me.c -o mini-me.o
--- mini-me.noexec ---
(cd /workspace/src/tests/sys/capsicum && DEPENDFILE=.depend.mini-me.noexec NO_SUBDIR=1 make -f /workspace/src/tests/sys/capsicum/Makefile _RECURSING_PROGS=t PROG=mini-me.noexec )
--- .depend.mini-me.noexec ---
echo mini-me.noexec.full: /tmp/obj/workspace/src/amd64.amd64/tmp/usr/lib/libc.a >> .depend.mini-me.noexec
--- mini-me.noexec.full ---
/usr/local/bin/x86_64-unknown-freebsd14.2-gcc12 --sysroot=/tmp/obj/workspace/src/amd64.amd64/tmp -B/usr/local/x86_64-unknown-freebsd14.2/bin/ -O2 -pipe -fno-common -I/workspace/src/tests -g -std=gnu99 -Wno-format-zero-length -fstack-protector-strong -Wsystem-headers -Werror -Wall -Wno-format-y2k -W -Wno-unused-parameter -Wmissing-prototypes -Wpointer-arith -Wreturn-type -Wcast-qual -Wwrite-strings -Wswitch -Wshadow -Wunused-parameter -Wcast-align -Wchar-subscripts -Wnested-externs -Wold-style-definition -Wno-pointer-sign -Wdate-time -Wno-error=address -Wno-error=array-bounds -Wno-error=attributes -Wno-error=bool-compare -Wno-error=cast-align -Wno-error=clobbered -Wno-error=deprecated-declarations -Wno-error=enum-compare -Wno-error=extra -Wno-error=logical-not-parentheses -Wno-error=strict-aliasing -Wno-error=uninitialized -Wno-error=unused-function -Wno-error=unused-value -Wno-error=empty-body -Wno-error=maybe-uninitialized -Wno-error=nonnull-compare -Wno-error=shift-negative-value -Wno-error=tautological-compare -Wno-error=unused-const-variable -Wno-error=bool-operation -Wno-error=deprecated -Wno-error=expansion-to-defined -Wno-error=format-overflow -Wno-error=format-truncation -Wno-error=implicit-fallthrough -Wno-error=int-in-bool-context -Wno-error=memset-elt-size -Wno-error=noexcept-type -Wno-error=nonnull -Wno-error=pointer-compare -Wno-error=stringop-overflow -Wno-error=aggressive-loop-optimizations -Wno-error=cast-function-type -Wno-error=catch-value -Wno-error=multistatement-macros -Wno-error=restrict -Wno-error=sizeof-pointer-memaccess -Wno-error=stringop-truncation -Wno-return-type -Wl,-zrelro -static -Wl,-znoexecstack -o mini-me.noexec.full mini-me.o
--- mini-me ---
--- mini-me.full ---
/usr/local/bin/x86_64-unknown-freebsd14.2-gcc12 --sysroot=/tmp/obj/workspace/src/amd64.amd64/tmp -B/usr/local/x86_64-unknown-freebsd14.2/bin/ -O2 -pipe -fno-common -I/workspace/src/tests -g -std=gnu99 -Wno-format-zero-length -fstack-protector-strong -Wsystem-headers -Werror -Wall -Wno-format-y2k -W -Wno-unused-parameter -Wmissing-prototypes -Wpointer-arith -Wreturn-type -Wcast-qual -Wwrite-strings -Wswitch -Wshadow -Wunused-parameter -Wcast-align -Wchar-subscripts -Wnested-externs -Wold-style-definition -Wno-pointer-sign -Wdate-time -Wno-error=address -Wno-error=array-bounds -Wno-error=attributes -Wno-error=bool-compare -Wno-error=cast-align -Wno-error=clobbered -Wno-error=deprecated-declarations -Wno-error=enum-compare -Wno-error=extra -Wno-error=logical-not-parentheses -Wno-error=strict-aliasing -Wno-error=uninitialized -Wno-error=unused-function -Wno-error=unused-value -Wno-error=empty-body -Wno-error=maybe-uninitialized -Wno-error=nonnull-compare -Wno-error=shift-negative-value -Wno-error=tautological-compare -Wno-error=unused-const-variable -Wno-error=bool-operation -Wno-error=deprecated -Wno-error=expansion-to-defined -Wno-error=format-overflow -Wno-error=format-truncation -Wno-error=implicit-fallthrough -Wno-error=int-in-bool-context -Wno-error=memset-elt-size -Wno-error=noexcept-type -Wno-error=nonnull -Wno-error=pointer-compare -Wno-error=stringop-overflow -Wno-error=aggressive-loop-optimizations -Wno-error=cast-function-type -Wno-error=catch-value -Wno-error=multistatement-macros -Wno-error=restrict -Wno-error=sizeof-pointer-memaccess -Wno-error=stringop-truncation -Wno-return-type -Wl,-zrelro -static -Wl,-znoexecstack -o mini-me.full mini-me.o
--- all_subdir_tests/sys/audit ---
--- file-delete.full ---
--- all_subdir_rescue ---
--- privsep.o ---
--- all_subdir_tests ---
/usr/local/bin/x86_64-unknown-freebsd14.2-gcc12 --sysroot=/tmp/obj/workspace/src/amd64.amd64/tmp -B/usr/local/x86_64-unknown-freebsd14.2/bin/ -O2 -pipe -fno-common -I/workspace/src/contrib/openbsm -g -std=gnu99 -Wno-format-zero-length -fstack-protector-strong -Wsystem-headers -Werror -Wall -Wno-format-y2k -W -Wno-unused-parameter -Wmissing-prototypes -Wpointer-arith -Wreturn-type -Wcast-qual -Wwrite-strings -Wswitch -Wshadow -Wunused-parameter -Wcast-align -Wchar-subscripts -Wnested-externs -Wold-style-definition -Wno-pointer-sign -Wdate-time -Wno-error=address -Wno-error=array-bounds -Wno-error=attributes -Wno-error=bool-compare -Wno-error=cast-align -Wno-error=clobbered -Wno-error=deprecated-declarations -Wno-error=enum-compare -Wno-error=extra -Wno-error=logical-not-parentheses -Wno-error=strict-aliasing -Wno-error=uninitialized -Wno-error=unused-function -Wno-error=unused-value -Wno-error=empty-body -Wno-error=maybe-uninitialized -Wno-error=nonnull-compare -Wno-error=shift-negative-value -Wno-error=tautological-compare -Wno-error=unused-const-variable -Wno-error=bool-operation -Wno-error=deprecated -Wno-error=expansion-to-defined -Wno-error=format-overflow -Wno-error=format-truncation -Wno-error=implicit-fallthrough -Wno-error=int-in-bool-context -Wno-error=memset-elt-size -Wno-error=noexcept-type -Wno-error=nonnull -Wno-error=pointer-compare -Wno-error=stringop-overflow -Wno-error=aggressive-loop-optimizations -Wno-error=cast-function-type -Wno-error=catch-value -Wno-error=multistatement-macros -Wno-error=restrict -Wno-error=sizeof-pointer-memaccess -Wno-error=stringop-truncation -Wno-return-type -lbsm -lutil -Wl,-zrelro -Wl,-znoexecstack -o file-delete.full file-delete.o utils.o /tmp/obj/workspace/src/amd64.amd64/tmp/usr/lib/libprivateauditd.a -lprivateatf-c
--- all_subdir_rescue ---
/usr/local/bin/x86_64-unknown-freebsd14.2-gcc12 --sysroot=/tmp/obj/workspace/src/amd64.amd64/tmp -B/usr/local/x86_64-unknown-freebsd14.2/bin/ -O2 -pipe -fno-common -DRESCUE -I/tmp/obj/workspace/src/amd64.amd64/lib/libifconfig -I/tmp/obj/workspace/src/amd64.amd64/lib/libiscsiutil -MD -MF.depend.privsep.o -MTprivsep.o -std=gnu99 -Wno-format-zero-length -fstack-protector-strong -Wsystem-headers -Werror -Wall -Wno-format-y2k -W -Wno-unused-parameter -Wmissing-prototypes -Wpointer-arith -Wreturn-type -Wcast-qual -Wwrite-strings -Wswitch -Wshadow -Wunused-parameter -Wchar-subscripts -Wnested-externs -Wold-style-definition -Wno-pointer-sign -Wdate-time -Wno-error=address -Wno-error=array-bounds -Wno-error=attributes -Wno-error=bool-compare -Wno-error=cast-align -Wno-error=clobbered -Wno-error=deprecated-declarations -Wno-error=enum-compare -Wno-error=extra -Wno-error=logical-not-parentheses -Wno-error=strict-aliasing -Wno-error=uninitialized -Wno-error=unused-function -Wno-error=unused-value -Wno-error=empty-body -Wno-error=maybe-uninitialized -Wno-error=nonnull-compare -Wno-error=shift-negative-value -Wno-error=tautological-compare -Wno-error=unused-const-variable -Wno-error=bool-operation -Wno-error=deprecated -Wno-error=expansion-to-defined -Wno-error=format-overflow -Wno-error=format-truncation -Wno-error=implicit-fallthrough -Wno-error=int-in-bool-context -Wno-error=memset-elt-size -Wno-error=noexcept-type -Wno-error=nonnull -Wno-error=pointer-compare -Wno-error=stringop-overflow -Wno-error=aggressive-loop-optimizations -Wno-error=cast-function-type -Wno-error=catch-value -Wno-error=multistatement-macros -Wno-error=restrict -Wno-error=sizeof-pointer-memaccess -Wno-error=stringop-truncation -Wno-return-type -c /workspace/src/sbin/dhclient/privsep.c -o privsep.o
--- all_subdir_tests ---
--- file-delete.debug ---
/usr/local/x86_64-unknown-freebsd14.2/bin/objcopy --only-keep-debug file-delete.full file-delete.debug
--- file-delete ---
/usr/local/x86_64-unknown-freebsd14.2/bin/objcopy --strip-debug --add-gnu-debuglink=file-delete.debug file-delete.full file-delete
--- file-close ---
(cd /workspace/src/tests/sys/audit && DEPENDFILE=.depend.file-close NO_SUBDIR=1 make -f /workspace/src/tests/sys/audit/Makefile _RECURSING_PROGS=t PROG=file-close )
--- all_subdir_tests/sys/capsicum ---
--- mini-me.noexec ---
/usr/local/bin/x86_64-unknown-freebsd14.2-ld: /tmp/obj/workspace/src/amd64.amd64/tmp/usr/lib/crt1.o: in function `_start':
/workspace/src/lib/csu/amd64/crt1_s.S:66:(.text+0x17): undefined reference to `main'
--- all_subdir_tests/sys/audit ---
--- .depend.file-close ---
echo file-close.full: /tmp/obj/workspace/src/amd64.amd64/tmp/usr/lib/libc.a /tmp/obj/workspace/src/amd64.amd64/tmp/usr/lib/libprivateatf-c.a >> .depend.file-close
--- file-close.o ---
/usr/local/bin/x86_64-unknown-freebsd14.2-gcc12 --sysroot=/tmp/obj/workspace/src/amd64.amd64/tmp -B/usr/local/x86_64-unknown-freebsd14.2/bin/ -O2 -pipe -fno-common -I/workspace/src/contrib/openbsm -g -MD -MF.depend.file-close.file-close.o -MTfile-close.o -std=gnu99 -Wno-format-zero-length -fstack-protector-strong -Wsystem-headers -Werror -Wall -Wno-format-y2k -W -Wno-unused-parameter -Wmissing-prototypes -Wpointer-arith -Wreturn-type -Wcast-qual -Wwrite-strings -Wswitch -Wshadow -Wunused-parameter -Wcast-align -Wchar-subscripts -Wnested-externs -Wold-style-definition -Wno-pointer-sign -Wdate-time -Wno-error=address -Wno-error=array-bounds -Wno-error=attributes -Wno-error=bool-compare -Wno-error=cast-align -Wno-error=clobbered -Wno-error=deprecated-declarations -Wno-error=enum-compare -Wno-error=extra -Wno-error=logical-not-parentheses -Wno-error=strict-aliasing -Wno-error=uninitialized -Wno-error=unused-function -Wno-error=unused-value -Wno-error=empty-body -Wno-error=maybe-uninitialized -Wno-error=nonnull-compare -Wno-error=shift-negative-value -Wno-error=tautological-compare -Wno-error=unused-const-variable -Wno-error=bool-operation -Wno-error=deprecated -Wno-error=expansion-to-defined -Wno-error=format-overflow -Wno-error=format-truncation -Wno-error=implicit-fallthrough -Wno-error=int-in-bool-context -Wno-error=memset-elt-size -Wno-error=noexcept-type -Wno-error=nonnull -Wno-error=pointer-compare -Wno-error=stringop-overflow -Wno-error=aggressive-loop-optimizations -Wno-error=cast-function-type -Wno-error=catch-value -Wno-error=multistatement-macros -Wno-error=restrict -Wno-error=sizeof-pointer-memaccess -Wno-error=stringop-truncation -Wno-return-type -c /workspace/src/tests/sys/audit/file-close.c -o file-close.o
--- all_subdir_tests/sys/capsicum ---
collect2: error: ld returned 1 exit status
make[3]: stopped in /workspace/src/tests
--- all_subdir_sbin ---
make[2]: stopped in /workspace/src
--- all_subdir_usr.bin ---
make[2]: stopped in /workspace/src
--- all_subdir_rescue ---
*** [objs] Error code 6
make[4]: stopped in /workspace/src/rescue/rescue
1 error
make[4]: stopped in /workspace/src/rescue/rescue
--- all_subdir_tests ---
make[2]: stopped in /workspace/src
--- all_subdir_usr.sbin ---
make[2]: stopped in /workspace/src
--- all_subdir_rescue ---
make[3]: stopped in /workspace/src/rescue
make[2]: stopped in /workspace/src
--- all_subdir_lib ---
make[3]: stopped in /workspace/src/lib
make[2]: stopped in /workspace/src
--- all_subdir_cddl ---
--- zfsd_unittest ---
make[6]: stopped in /workspace/src/cddl/usr.sbin/zfsd/tests
make[5]: stopped in /workspace/src/cddl/usr.sbin/zfsd
make[4]: stopped in /workspace/src/cddl/usr.sbin
make[3]: stopped in /workspace/src/cddl
make[2]: stopped in /workspace/src
88.43 real 681.01 user 81.98 sys
make[1]: stopped in /workspace/src
make: stopped in /workspace/src
Build step 'Execute shell' marked build as failure
[WARNINGS]Skipping publisher since build result is FAILURE
[PostBuildScript] - [INFO] Executing post build scripts.
[FreeBSD-stable-14-amd64-gcc12_build] $ /bin/sh -xe /tmp/jenkins9433515186627398115.sh
+ sh freebsd-ci/scripts/jail/clean.sh
clean jail FreeBSD-stable-14-amd64-gcc12_build
Checking for post-build
Performing post-build step
Checking if email needs to be generated
Email was triggered for: Failure - Any
Sending email for trigger: Failure - Any
Sending mail from default account using System Admin e-mail address