FreeBSD-main-amd64-test - Build #26438 - Still Unstable
Date: Wed, 21 May 2025 09:35:05 UTC
FreeBSD-main-amd64-test - Build #26438 (1f922483cc993e282329ffed9096f437799b630e) - Still Unstable
Build information: https://ci.FreeBSD.org/job/FreeBSD-main-amd64-test/26438/
Full change log: https://ci.FreeBSD.org/job/FreeBSD-main-amd64-test/26438/changes
Full build log: https://ci.FreeBSD.org/job/FreeBSD-main-amd64-test/26438/console
Status explanation:
"Unstable" - some tests are suspected being broken by the following changes
"Still Unstable" - the failing test cases have not been fixed by these
following changes and this is a notification to note that
these changes have not been fully tested by the CI system
Change summaries:
(Those commits are likely but not certainly responsible)
5319cb21610ad947c56fd0cd4f18ef5b58bc8db7 by markj:
file: Qualify pointers to capsicum rights as const
1f922483cc993e282329ffed9096f437799b630e by markj:
capsicum: Statically initialize commonly used capability rights
The failed test cases:
4 tests failed.
FAILED: sys.kqueue.libkqueue.kqueue_test.main
Error Message:
Received signal 6
FAILED: sys.opencrypto.runtests.main
Error Message:
1 of 1 tests failed
FAILED: sys.netinet.broadcast.INADDR_BROADCAST
Error Message:
/usr/src/tests/sys/netinet/broadcast.c:65: sending of broadcast failed: 51
FAILED: sys.netinet.fibs_test.same_ip_multiple_ifaces_fib0
Error Message:
atf-check failed; see the output of the test for details