FreeBSD-main-amd64-test - Build #26434 - Still Unstable

From: <jenkins-admin_at_FreeBSD.org>
Date: Tue, 20 May 2025 21:49:01 UTC
FreeBSD-main-amd64-test - Build #26434 (964b0ece795a4e2c811753873bf6883ffb160af8) - Still Unstable

Build information: https://ci.FreeBSD.org/job/FreeBSD-main-amd64-test/26434/
Full change log: https://ci.FreeBSD.org/job/FreeBSD-main-amd64-test/26434/changes
Full build log: https://ci.FreeBSD.org/job/FreeBSD-main-amd64-test/26434/console

Status explanation:
"Unstable" - some tests are suspected being broken by the following changes
"Still Unstable" - the failing test cases have not been fixed by these
                   following changes and this is a notification to note that
                   these changes have not been fully tested by the CI system

Change summaries:
(Those commits are likely but not certainly responsible)

fba91af3b09b0cb021a50da2bc78e44dfd49b69a by bnovkov:
makefs: Honor -T timestamps when creating images from mtree manifests

1e904d6742bbed99387cc6bcb00dc088192f65df by bnovkov:
makefs: Remove redundant 'stampst' checks in several backends

964b0ece795a4e2c811753873bf6883ffb160af8 by bnovkov:
makefs: Add tests for the -T flag



The failed test cases:

6 tests failed.
FAILED:  lib.libcasper.services.cap_fileargs.fileargs_test.fileargs__fopen_write

Error Message:
/usr/src/lib/libcasper/services/cap_fileargs/tests/fileargs_test.c:528: test_file_fopen(fa, files[i], "w", &pfile) == 0 not met

FAILED:  lib.libcasper.services.cap_fileargs.fileargs_test.fileargs__open_write

Error Message:
/usr/src/lib/libcasper/services/cap_fileargs/tests/fileargs_test.c:350: test_file_open(fa, files[i], &fd) == 0 not met

FAILED:  sys.kqueue.libkqueue.kqueue_test.main

Error Message:
Received signal 6

FAILED:  lib.libcasper.services.cap_fileargs.fileargs_test.fileargs__open_realpath

Error Message:
/usr/src/lib/libcasper/services/cap_fileargs/tests/fileargs_test.c:733: test_file_open(fa, files[i], &fd) == 0 not met

FAILED:  sys.netinet.broadcast.INADDR_BROADCAST

Error Message:
/usr/src/tests/sys/netinet/broadcast.c:65: sending of broadcast failed: 51

FAILED:  sys.netinet.fibs_test.same_ip_multiple_ifaces_fib0

Error Message:
atf-check failed; see the output of the test for details