FreeBSD-main-amd64-test - Build #26422 - Still Unstable
Date: Mon, 19 May 2025 09:59:53 UTC
FreeBSD-main-amd64-test - Build #26422 (26b3641f97d9025a7c12b70935098892ae26ca0c) - Still Unstable
Build information: https://ci.FreeBSD.org/job/FreeBSD-main-amd64-test/26422/
Full change log: https://ci.FreeBSD.org/job/FreeBSD-main-amd64-test/26422/changes
Full build log: https://ci.FreeBSD.org/job/FreeBSD-main-amd64-test/26422/console
Status explanation:
"Unstable" - some tests are suspected being broken by the following changes
"Still Unstable" - the failing test cases have not been fixed by these
following changes and this is a notification to note that
these changes have not been fully tested by the CI system
Change summaries:
(Those commits are likely but not certainly responsible)
8f25fac9ce2339ab5599e3af0ef7c6a1ea098aab by ziaee:
cxgbetool.8: Fix some minor mechanical issues
26b3641f97d9025a7c12b70935098892ae26ca0c by dougm:
vm_page_grab_pages: avoid doomed range lookups
The failed test cases:
3 tests failed.
FAILED: sys.opencrypto.runtests.main
Error Message:
1 of 1 tests failed
FAILED: sys.netinet.broadcast.INADDR_BROADCAST
Error Message:
/usr/src/tests/sys/netinet/broadcast.c:65: sending of broadcast failed: 51
FAILED: sys.netinet.fibs_test.same_ip_multiple_ifaces_fib0
Error Message:
atf-check failed; see the output of the test for details