FreeBSD-main-amd64-gcc12_build - Build #5518 - Failure
- Go to: [ bottom of page ] [ top of archives ] [ this month ]
Date: Wed, 14 May 2025 21:06:40 UTC
FreeBSD-main-amd64-gcc12_build - Build #5518 (dd3d1a7694583362f5915ff5f1d9cdee64e2fe3e) - Failure
Build information: https://ci.FreeBSD.org/job/FreeBSD-main-amd64-gcc12_build/5518/
Full change log: https://ci.FreeBSD.org/job/FreeBSD-main-amd64-gcc12_build/5518/changes
Full build log: https://ci.FreeBSD.org/job/FreeBSD-main-amd64-gcc12_build/5518/console
Status explanation:
"Failure" - the build is suspected being broken by the following changes
"Still Failing" - the build has not been fixed by the following changes and
this is a notification to note that these changes have
not been fully tested by the CI system
Change summaries:
(Those commits are likely but not certainly responsible)
dd3d1a7694583362f5915ff5f1d9cdee64e2fe3e by ziaee:
build.7: Document pkgbase PKG_FORMAT variable
The end of the build log:
[...truncated 130.52 MiB...]
--- atkbd_atkbdc.o ---
ctfconvert -L VERSION -g atkbd_atkbdc.o
--- atkbdc_isa.o ---
/usr/local/bin/x86_64-unknown-freebsd14.2-gcc12 --sysroot=/tmp/obj/workspace/src/amd64.amd64/tmp -B/usr/local/x86_64-unknown-freebsd14.2/bin/ -c -O2 -pipe -frename-registers -fno-strict-aliasing -g -nostdinc -I. -I/workspace/src/sys -I/workspace/src/sys/contrib/ck/include -I/workspace/src/sys/contrib/libfdt -D_KERNEL -DHAVE_KERNEL_OPTION_HEADERS -include opt_global.h -fno-common -fno-omit-frame-pointer -mno-omit-leaf-frame-pointer -MD -MF.depend.atkbdc_isa.o -MTatkbdc_isa.o -fdebug-prefix-map=./machine=/workspace/src/sys/amd64/include -fdebug-prefix-map=./x86=/workspace/src/sys/x86/include -fdebug-prefix-map=./i386=/workspace/src/sys/i386/include -mcmodel=kernel -mno-red-zone -mno-mmx -mno-sse -msoft-float -fno-asynchronous-unwind-tables -ffreestanding -fwrapv -fstack-protector -gdwarf-4 -Wall -Wstrict-prototypes -Wmissing-prototypes -Wpointer-arith -Wcast-qual -Wundef -Wno-pointer-sign -D__printf__=__freebsd_kprintf__ -Wmissing-include-dirs -fdiagnostics-show-option -Wno-unknown-pragmas -Wswitch -Wno-error=address -Wno-error=aggressive-loop-optimizations -Wno-error=array-bounds -Wno-error=attributes -Wno-error=cast-qual -Wno-error=enum-compare -Wno-error=maybe-uninitialized -Wno-error=misleading-indentation -Wno-error=nonnull-compare -Wno-error=overflow -Wno-error=sequence-point -Wno-error=shift-overflow -Wno-error=tautological-compare -Wno-error=unused-function -Wno-error=stringop-overflow -Wno-error=memset-elt-size -Wno-error=packed-not-aligned -Wno-address-of-packed-member -Wno-alloc-size-larger-than -Wno-error=alloca-larger-than= -Wno-error=nonnull -Wno-dangling-pointer -Wno-zero-length-bounds -Wno-return-type -Wno-format-zero-length -fms-extensions -finline-limit=8000 --param inline-unit-growth=100 --param large-function-growth=1000 -fms-extensions -std=gnu17 -Werror /workspace/src/sys/dev/atkbdc/atkbdc_isa.c
--- atkbdc_subr.o ---
/usr/local/bin/x86_64-unknown-freebsd14.2-gcc12 --sysroot=/tmp/obj/workspace/src/amd64.amd64/tmp -B/usr/local/x86_64-unknown-freebsd14.2/bin/ -c -O2 -pipe -frename-registers -fno-strict-aliasing -g -nostdinc -I. -I/workspace/src/sys -I/workspace/src/sys/contrib/ck/include -I/workspace/src/sys/contrib/libfdt -D_KERNEL -DHAVE_KERNEL_OPTION_HEADERS -include opt_global.h -fno-common -fno-omit-frame-pointer -mno-omit-leaf-frame-pointer -MD -MF.depend.atkbdc_subr.o -MTatkbdc_subr.o -fdebug-prefix-map=./machine=/workspace/src/sys/amd64/include -fdebug-prefix-map=./x86=/workspace/src/sys/x86/include -fdebug-prefix-map=./i386=/workspace/src/sys/i386/include -mcmodel=kernel -mno-red-zone -mno-mmx -mno-sse -msoft-float -fno-asynchronous-unwind-tables -ffreestanding -fwrapv -fstack-protector -gdwarf-4 -Wall -Wstrict-prototypes -Wmissing-prototypes -Wpointer-arith -Wcast-qual -Wundef -Wno-pointer-sign -D__printf__=__freebsd_kprintf__ -Wmissing-include-dirs -fdiagnostics-show-option -Wno-unknown-pragmas -Wswitch -Wno-error=address -Wno-error=aggressive-loop-optimizations -Wno-error=array-bounds -Wno-error=attributes -Wno-error=cast-qual -Wno-error=enum-compare -Wno-error=maybe-uninitialized -Wno-error=misleading-indentation -Wno-error=nonnull-compare -Wno-error=overflow -Wno-error=sequence-point -Wno-error=shift-overflow -Wno-error=tautological-compare -Wno-error=unused-function -Wno-error=stringop-overflow -Wno-error=memset-elt-size -Wno-error=packed-not-aligned -Wno-address-of-packed-member -Wno-alloc-size-larger-than -Wno-error=alloca-larger-than= -Wno-error=nonnull -Wno-dangling-pointer -Wno-zero-length-bounds -Wno-return-type -Wno-format-zero-length -fms-extensions -finline-limit=8000 --param inline-unit-growth=100 --param large-function-growth=1000 -fms-extensions -std=gnu17 -Werror /workspace/src/sys/dev/atkbdc/atkbdc_subr.c
--- agp_amd64.o ---
ctfconvert -L VERSION -g agp_amd64.o
--- psm.o ---
/usr/local/bin/x86_64-unknown-freebsd14.2-gcc12 --sysroot=/tmp/obj/workspace/src/amd64.amd64/tmp -B/usr/local/x86_64-unknown-freebsd14.2/bin/ -c -O2 -pipe -frename-registers -fno-strict-aliasing -g -nostdinc -I. -I/workspace/src/sys -I/workspace/src/sys/contrib/ck/include -I/workspace/src/sys/contrib/libfdt -D_KERNEL -DHAVE_KERNEL_OPTION_HEADERS -include opt_global.h -fno-common -fno-omit-frame-pointer -mno-omit-leaf-frame-pointer -MD -MF.depend.psm.o -MTpsm.o -fdebug-prefix-map=./machine=/workspace/src/sys/amd64/include -fdebug-prefix-map=./x86=/workspace/src/sys/x86/include -fdebug-prefix-map=./i386=/workspace/src/sys/i386/include -mcmodel=kernel -mno-red-zone -mno-mmx -mno-sse -msoft-float -fno-asynchronous-unwind-tables -ffreestanding -fwrapv -fstack-protector -gdwarf-4 -Wall -Wstrict-prototypes -Wmissing-prototypes -Wpointer-arith -Wcast-qual -Wundef -Wno-pointer-sign -D__printf__=__freebsd_kprintf__ -Wmissing-include-dirs -fdiagnostics-show-option -Wno-unknown-pragmas -Wswitch -Wno-error=address -Wno-error=aggressive-loop-optimizations -Wno-error=array-bounds -Wno-error=attributes -Wno-error=cast-qual -Wno-error=enum-compare -Wno-error=maybe-uninitialized -Wno-error=misleading-indentation -Wno-error=nonnull-compare -Wno-error=overflow -Wno-error=sequence-point -Wno-error=shift-overflow -Wno-error=tautological-compare -Wno-error=unused-function -Wno-error=stringop-overflow -Wno-error=memset-elt-size -Wno-error=packed-not-aligned -Wno-address-of-packed-member -Wno-alloc-size-larger-than -Wno-error=alloca-larger-than= -Wno-error=nonnull -Wno-dangling-pointer -Wno-zero-length-bounds -Wno-return-type -Wno-format-zero-length -fms-extensions -finline-limit=8000 --param inline-unit-growth=100 --param large-function-growth=1000 -fms-extensions -std=gnu17 -Werror /workspace/src/sys/dev/atkbdc/psm.c
--- uma_core.o ---
ctfconvert -L VERSION -g uma_core.o
--- acpi_pci_link.o ---
ctfconvert -L VERSION -g acpi_pci_link.o
--- bxe.o ---
/usr/local/bin/x86_64-unknown-freebsd14.2-gcc12 --sysroot=/tmp/obj/workspace/src/amd64.amd64/tmp -B/usr/local/x86_64-unknown-freebsd14.2/bin/ -c -O2 -pipe -frename-registers -fno-strict-aliasing -g -nostdinc -I. -I/workspace/src/sys -I/workspace/src/sys/contrib/ck/include -I/workspace/src/sys/contrib/libfdt -D_KERNEL -DHAVE_KERNEL_OPTION_HEADERS -include opt_global.h -fno-common -fno-omit-frame-pointer -mno-omit-leaf-frame-pointer -MD -MF.depend.bxe.o -MTbxe.o -fdebug-prefix-map=./machine=/workspace/src/sys/amd64/include -fdebug-prefix-map=./x86=/workspace/src/sys/x86/include -fdebug-prefix-map=./i386=/workspace/src/sys/i386/include -mcmodel=kernel -mno-red-zone -mno-mmx -mno-sse -msoft-float -fno-asynchronous-unwind-tables -ffreestanding -fwrapv -fstack-protector -gdwarf-4 -Wall -Wstrict-prototypes -Wmissing-prototypes -Wpointer-arith -Wcast-qual -Wundef -Wno-pointer-sign -D__printf__=__freebsd_kprintf__ -Wmissing-include-dirs -fdiagnostics-show-option -Wno-unknown-pragmas -Wswitch -Wno-error=address -Wno-error=aggressive-loop-optimizations -Wno-error=array-bounds -Wno-error=attributes -Wno-error=cast-qual -Wno-error=enum-compare -Wno-error=maybe-uninitialized -Wno-error=misleading-indentation -Wno-error=nonnull-compare -Wno-error=overflow -Wno-error=sequence-point -Wno-error=shift-overflow -Wno-error=tautological-compare -Wno-error=unused-function -Wno-error=stringop-overflow -Wno-error=memset-elt-size -Wno-error=packed-not-aligned -Wno-address-of-packed-member -Wno-alloc-size-larger-than -Wno-error=alloca-larger-than= -Wno-error=nonnull -Wno-dangling-pointer -Wno-zero-length-bounds -Wno-return-type -Wno-format-zero-length -fms-extensions -finline-limit=8000 --param inline-unit-growth=100 --param large-function-growth=1000 -fms-extensions -std=gnu17 -Werror /workspace/src/sys/dev/bxe/bxe.c
--- bxe_stats.o ---
/usr/local/bin/x86_64-unknown-freebsd14.2-gcc12 --sysroot=/tmp/obj/workspace/src/amd64.amd64/tmp -B/usr/local/x86_64-unknown-freebsd14.2/bin/ -c -O2 -pipe -frename-registers -fno-strict-aliasing -g -nostdinc -I. -I/workspace/src/sys -I/workspace/src/sys/contrib/ck/include -I/workspace/src/sys/contrib/libfdt -D_KERNEL -DHAVE_KERNEL_OPTION_HEADERS -include opt_global.h -fno-common -fno-omit-frame-pointer -mno-omit-leaf-frame-pointer -MD -MF.depend.bxe_stats.o -MTbxe_stats.o -fdebug-prefix-map=./machine=/workspace/src/sys/amd64/include -fdebug-prefix-map=./x86=/workspace/src/sys/x86/include -fdebug-prefix-map=./i386=/workspace/src/sys/i386/include -mcmodel=kernel -mno-red-zone -mno-mmx -mno-sse -msoft-float -fno-asynchronous-unwind-tables -ffreestanding -fwrapv -fstack-protector -gdwarf-4 -Wall -Wstrict-prototypes -Wmissing-prototypes -Wpointer-arith -Wcast-qual -Wundef -Wno-pointer-sign -D__printf__=__freebsd_kprintf__ -Wmissing-include-dirs -fdiagnostics-show-option -Wno-unknown-pragmas -Wswitch -Wno-error=address -Wno-error=aggressive-loop-optimizations -Wno-error=array-bounds -Wno-error=attributes -Wno-error=cast-qual -Wno-error=enum-compare -Wno-error=maybe-uninitialized -Wno-error=misleading-indentation -Wno-error=nonnull-compare -Wno-error=overflow -Wno-error=sequence-point -Wno-error=shift-overflow -Wno-error=tautological-compare -Wno-error=unused-function -Wno-error=stringop-overflow -Wno-error=memset-elt-size -Wno-error=packed-not-aligned -Wno-address-of-packed-member -Wno-alloc-size-larger-than -Wno-error=alloca-larger-than= -Wno-error=nonnull -Wno-dangling-pointer -Wno-zero-length-bounds -Wno-return-type -Wno-format-zero-length -fms-extensions -finline-limit=8000 --param inline-unit-growth=100 --param large-function-growth=1000 -fms-extensions -std=gnu17 -Werror /workspace/src/sys/dev/bxe/bxe_stats.c
--- atkbdc_subr.o ---
ctfconvert -L VERSION -g atkbdc_subr.o
--- bxe_debug.o ---
/usr/local/bin/x86_64-unknown-freebsd14.2-gcc12 --sysroot=/tmp/obj/workspace/src/amd64.amd64/tmp -B/usr/local/x86_64-unknown-freebsd14.2/bin/ -c -O2 -pipe -frename-registers -fno-strict-aliasing -g -nostdinc -I. -I/workspace/src/sys -I/workspace/src/sys/contrib/ck/include -I/workspace/src/sys/contrib/libfdt -D_KERNEL -DHAVE_KERNEL_OPTION_HEADERS -include opt_global.h -fno-common -fno-omit-frame-pointer -mno-omit-leaf-frame-pointer -MD -MF.depend.bxe_debug.o -MTbxe_debug.o -fdebug-prefix-map=./machine=/workspace/src/sys/amd64/include -fdebug-prefix-map=./x86=/workspace/src/sys/x86/include -fdebug-prefix-map=./i386=/workspace/src/sys/i386/include -mcmodel=kernel -mno-red-zone -mno-mmx -mno-sse -msoft-float -fno-asynchronous-unwind-tables -ffreestanding -fwrapv -fstack-protector -gdwarf-4 -Wall -Wstrict-prototypes -Wmissing-prototypes -Wpointer-arith -Wcast-qual -Wundef -Wno-pointer-sign -D__printf__=__freebsd_kprintf__ -Wmissing-include-dirs -fdiagnostics-show-option -Wno-unknown-pragmas -Wswitch -Wno-error=address -Wno-error=aggressive-loop-optimizations -Wno-error=array-bounds -Wno-error=attributes -Wno-error=cast-qual -Wno-error=enum-compare -Wno-error=maybe-uninitialized -Wno-error=misleading-indentation -Wno-error=nonnull-compare -Wno-error=overflow -Wno-error=sequence-point -Wno-error=shift-overflow -Wno-error=tautological-compare -Wno-error=unused-function -Wno-error=stringop-overflow -Wno-error=memset-elt-size -Wno-error=packed-not-aligned -Wno-address-of-packed-member -Wno-alloc-size-larger-than -Wno-error=alloca-larger-than= -Wno-error=nonnull -Wno-dangling-pointer -Wno-zero-length-bounds -Wno-return-type -Wno-format-zero-length -fms-extensions -finline-limit=8000 --param inline-unit-growth=100 --param large-function-growth=1000 -fms-extensions -std=gnu17 -Werror /workspace/src/sys/dev/bxe/bxe_debug.c
--- atkbdc_isa.o ---
ctfconvert -L VERSION -g atkbdc_isa.o
--- ecore_sp.o ---
/usr/local/bin/x86_64-unknown-freebsd14.2-gcc12 --sysroot=/tmp/obj/workspace/src/amd64.amd64/tmp -B/usr/local/x86_64-unknown-freebsd14.2/bin/ -c -O2 -pipe -frename-registers -fno-strict-aliasing -g -nostdinc -I. -I/workspace/src/sys -I/workspace/src/sys/contrib/ck/include -I/workspace/src/sys/contrib/libfdt -D_KERNEL -DHAVE_KERNEL_OPTION_HEADERS -include opt_global.h -fno-common -fno-omit-frame-pointer -mno-omit-leaf-frame-pointer -MD -MF.depend.ecore_sp.o -MTecore_sp.o -fdebug-prefix-map=./machine=/workspace/src/sys/amd64/include -fdebug-prefix-map=./x86=/workspace/src/sys/x86/include -fdebug-prefix-map=./i386=/workspace/src/sys/i386/include -mcmodel=kernel -mno-red-zone -mno-mmx -mno-sse -msoft-float -fno-asynchronous-unwind-tables -ffreestanding -fwrapv -fstack-protector -gdwarf-4 -Wall -Wstrict-prototypes -Wmissing-prototypes -Wpointer-arith -Wcast-qual -Wundef -Wno-pointer-sign -D__printf__=__freebsd_kprintf__ -Wmissing-include-dirs -fdiagnostics-show-option -Wno-unknown-pragmas -Wswitch -Wno-error=address -Wno-error=aggressive-loop-optimizations -Wno-error=array-bounds -Wno-error=attributes -Wno-error=cast-qual -Wno-error=enum-compare -Wno-error=maybe-uninitialized -Wno-error=misleading-indentation -Wno-error=nonnull-compare -Wno-error=overflow -Wno-error=sequence-point -Wno-error=shift-overflow -Wno-error=tautological-compare -Wno-error=unused-function -Wno-error=stringop-overflow -Wno-error=memset-elt-size -Wno-error=packed-not-aligned -Wno-address-of-packed-member -Wno-alloc-size-larger-than -Wno-error=alloca-larger-than= -Wno-error=nonnull -Wno-dangling-pointer -Wno-zero-length-bounds -Wno-return-type -Wno-format-zero-length -fms-extensions -finline-limit=8000 --param inline-unit-growth=100 --param large-function-growth=1000 -fms-extensions -std=gnu17 -Werror /workspace/src/sys/dev/bxe/ecore_sp.c
--- bxe_debug.o ---
ctfconvert -L VERSION -g bxe_debug.o
--- bxe_elink.o ---
/usr/local/bin/x86_64-unknown-freebsd14.2-gcc12 --sysroot=/tmp/obj/workspace/src/amd64.amd64/tmp -B/usr/local/x86_64-unknown-freebsd14.2/bin/ -c -O2 -pipe -frename-registers -fno-strict-aliasing -g -nostdinc -I. -I/workspace/src/sys -I/workspace/src/sys/contrib/ck/include -I/workspace/src/sys/contrib/libfdt -D_KERNEL -DHAVE_KERNEL_OPTION_HEADERS -include opt_global.h -fno-common -fno-omit-frame-pointer -mno-omit-leaf-frame-pointer -MD -MF.depend.bxe_elink.o -MTbxe_elink.o -fdebug-prefix-map=./machine=/workspace/src/sys/amd64/include -fdebug-prefix-map=./x86=/workspace/src/sys/x86/include -fdebug-prefix-map=./i386=/workspace/src/sys/i386/include -mcmodel=kernel -mno-red-zone -mno-mmx -mno-sse -msoft-float -fno-asynchronous-unwind-tables -ffreestanding -fwrapv -fstack-protector -gdwarf-4 -Wall -Wstrict-prototypes -Wmissing-prototypes -Wpointer-arith -Wcast-qual -Wundef -Wno-pointer-sign -D__printf__=__freebsd_kprintf__ -Wmissing-include-dirs -fdiagnostics-show-option -Wno-unknown-pragmas -Wswitch -Wno-error=address -Wno-error=aggressive-loop-optimizations -Wno-error=array-bounds -Wno-error=attributes -Wno-error=cast-qual -Wno-error=enum-compare -Wno-error=maybe-uninitialized -Wno-error=misleading-indentation -Wno-error=nonnull-compare -Wno-error=overflow -Wno-error=sequence-point -Wno-error=shift-overflow -Wno-error=tautological-compare -Wno-error=unused-function -Wno-error=stringop-overflow -Wno-error=memset-elt-size -Wno-error=packed-not-aligned -Wno-address-of-packed-member -Wno-alloc-size-larger-than -Wno-error=alloca-larger-than= -Wno-error=nonnull -Wno-dangling-pointer -Wno-zero-length-bounds -Wno-return-type -Wno-format-zero-length -fms-extensions -finline-limit=8000 --param inline-unit-growth=100 --param large-function-growth=1000 -fms-extensions -std=gnu17 -Werror /workspace/src/sys/dev/bxe/bxe_elink.c
--- agp_i810.o ---
ctfconvert -L VERSION -g agp_i810.o
--- 57710_init_values.o ---
/usr/local/bin/x86_64-unknown-freebsd14.2-gcc12 --sysroot=/tmp/obj/workspace/src/amd64.amd64/tmp -B/usr/local/x86_64-unknown-freebsd14.2/bin/ -c -O2 -pipe -frename-registers -fno-strict-aliasing -g -nostdinc -I. -I/workspace/src/sys -I/workspace/src/sys/contrib/ck/include -I/workspace/src/sys/contrib/libfdt -D_KERNEL -DHAVE_KERNEL_OPTION_HEADERS -include opt_global.h -fno-common -fno-omit-frame-pointer -mno-omit-leaf-frame-pointer -MD -MF.depend.57710_init_values.o -MT57710_init_values.o -fdebug-prefix-map=./machine=/workspace/src/sys/amd64/include -fdebug-prefix-map=./x86=/workspace/src/sys/x86/include -fdebug-prefix-map=./i386=/workspace/src/sys/i386/include -mcmodel=kernel -mno-red-zone -mno-mmx -mno-sse -msoft-float -fno-asynchronous-unwind-tables -ffreestanding -fwrapv -fstack-protector -gdwarf-4 -Wall -Wstrict-prototypes -Wmissing-prototypes -Wpointer-arith -Wcast-qual -Wundef -Wno-pointer-sign -D__printf__=__freebsd_kprintf__ -Wmissing-include-dirs -fdiagnostics-show-option -Wno-unknown-pragmas -Wswitch -Wno-error=address -Wno-error=aggressive-loop-optimizations -Wno-error=array-bounds -Wno-error=attributes -Wno-error=cast-qual -Wno-error=enum-compare -Wno-error=maybe-uninitialized -Wno-error=misleading-indentation -Wno-error=nonnull-compare -Wno-error=overflow -Wno-error=sequence-point -Wno-error=shift-overflow -Wno-error=tautological-compare -Wno-error=unused-function -Wno-error=stringop-overflow -Wno-error=memset-elt-size -Wno-error=packed-not-aligned -Wno-address-of-packed-member -Wno-alloc-size-larger-than -Wno-error=alloca-larger-than= -Wno-error=nonnull -Wno-dangling-pointer -Wno-zero-length-bounds -Wno-return-type -Wno-format-zero-length -fms-extensions -finline-limit=8000 --param inline-unit-growth=100 --param large-function-growth=1000 -fms-extensions -std=gnu17 -Werror /workspace/src/sys/dev/bxe/57710_init_values.c
--- atkbd.o ---
ctfconvert -L VERSION -g atkbd.o
--- 57711_init_values.o ---
/usr/local/bin/x86_64-unknown-freebsd14.2-gcc12 --sysroot=/tmp/obj/workspace/src/amd64.amd64/tmp -B/usr/local/x86_64-unknown-freebsd14.2/bin/ -c -O2 -pipe -frename-registers -fno-strict-aliasing -g -nostdinc -I. -I/workspace/src/sys -I/workspace/src/sys/contrib/ck/include -I/workspace/src/sys/contrib/libfdt -D_KERNEL -DHAVE_KERNEL_OPTION_HEADERS -include opt_global.h -fno-common -fno-omit-frame-pointer -mno-omit-leaf-frame-pointer -MD -MF.depend.57711_init_values.o -MT57711_init_values.o -fdebug-prefix-map=./machine=/workspace/src/sys/amd64/include -fdebug-prefix-map=./x86=/workspace/src/sys/x86/include -fdebug-prefix-map=./i386=/workspace/src/sys/i386/include -mcmodel=kernel -mno-red-zone -mno-mmx -mno-sse -msoft-float -fno-asynchronous-unwind-tables -ffreestanding -fwrapv -fstack-protector -gdwarf-4 -Wall -Wstrict-prototypes -Wmissing-prototypes -Wpointer-arith -Wcast-qual -Wundef -Wno-pointer-sign -D__printf__=__freebsd_kprintf__ -Wmissing-include-dirs -fdiagnostics-show-option -Wno-unknown-pragmas -Wswitch -Wno-error=address -Wno-error=aggressive-loop-optimizations -Wno-error=array-bounds -Wno-error=attributes -Wno-error=cast-qual -Wno-error=enum-compare -Wno-error=maybe-uninitialized -Wno-error=misleading-indentation -Wno-error=nonnull-compare -Wno-error=overflow -Wno-error=sequence-point -Wno-error=shift-overflow -Wno-error=tautological-compare -Wno-error=unused-function -Wno-error=stringop-overflow -Wno-error=memset-elt-size -Wno-error=packed-not-aligned -Wno-address-of-packed-member -Wno-alloc-size-larger-than -Wno-error=alloca-larger-than= -Wno-error=nonnull -Wno-dangling-pointer -Wno-zero-length-bounds -Wno-return-type -Wno-format-zero-length -fms-extensions -finline-limit=8000 --param inline-unit-growth=100 --param large-function-growth=1000 -fms-extensions -std=gnu17 -Werror /workspace/src/sys/dev/bxe/57711_init_values.c
--- vm_map.o ---
ctfconvert -L VERSION -g vm_map.o
--- 57712_init_values.o ---
/usr/local/bin/x86_64-unknown-freebsd14.2-gcc12 --sysroot=/tmp/obj/workspace/src/amd64.amd64/tmp -B/usr/local/x86_64-unknown-freebsd14.2/bin/ -c -O2 -pipe -frename-registers -fno-strict-aliasing -g -nostdinc -I. -I/workspace/src/sys -I/workspace/src/sys/contrib/ck/include -I/workspace/src/sys/contrib/libfdt -D_KERNEL -DHAVE_KERNEL_OPTION_HEADERS -include opt_global.h -fno-common -fno-omit-frame-pointer -mno-omit-leaf-frame-pointer -MD -MF.depend.57712_init_values.o -MT57712_init_values.o -fdebug-prefix-map=./machine=/workspace/src/sys/amd64/include -fdebug-prefix-map=./x86=/workspace/src/sys/x86/include -fdebug-prefix-map=./i386=/workspace/src/sys/i386/include -mcmodel=kernel -mno-red-zone -mno-mmx -mno-sse -msoft-float -fno-asynchronous-unwind-tables -ffreestanding -fwrapv -fstack-protector -gdwarf-4 -Wall -Wstrict-prototypes -Wmissing-prototypes -Wpointer-arith -Wcast-qual -Wundef -Wno-pointer-sign -D__printf__=__freebsd_kprintf__ -Wmissing-include-dirs -fdiagnostics-show-option -Wno-unknown-pragmas -Wswitch -Wno-error=address -Wno-error=aggressive-loop-optimizations -Wno-error=array-bounds -Wno-error=attributes -Wno-error=cast-qual -Wno-error=enum-compare -Wno-error=maybe-uninitialized -Wno-error=misleading-indentation -Wno-error=nonnull-compare -Wno-error=overflow -Wno-error=sequence-point -Wno-error=shift-overflow -Wno-error=tautological-compare -Wno-error=unused-function -Wno-error=stringop-overflow -Wno-error=memset-elt-size -Wno-error=packed-not-aligned -Wno-address-of-packed-member -Wno-alloc-size-larger-than -Wno-error=alloca-larger-than= -Wno-error=nonnull -Wno-dangling-pointer -Wno-zero-length-bounds -Wno-return-type -Wno-format-zero-length -fms-extensions -finline-limit=8000 --param inline-unit-growth=100 --param large-function-growth=1000 -fms-extensions -std=gnu17 -Werror /workspace/src/sys/dev/bxe/57712_init_values.c
--- 57710_init_values.o ---
ctfconvert -L VERSION -g 57710_init_values.o
--- fb.o ---
/usr/local/bin/x86_64-unknown-freebsd14.2-gcc12 --sysroot=/tmp/obj/workspace/src/amd64.amd64/tmp -B/usr/local/x86_64-unknown-freebsd14.2/bin/ -c -O2 -pipe -frename-registers -fno-strict-aliasing -g -nostdinc -I. -I/workspace/src/sys -I/workspace/src/sys/contrib/ck/include -I/workspace/src/sys/contrib/libfdt -D_KERNEL -DHAVE_KERNEL_OPTION_HEADERS -include opt_global.h -fno-common -fno-omit-frame-pointer -mno-omit-leaf-frame-pointer -MD -MF.depend.fb.o -MTfb.o -fdebug-prefix-map=./machine=/workspace/src/sys/amd64/include -fdebug-prefix-map=./x86=/workspace/src/sys/x86/include -fdebug-prefix-map=./i386=/workspace/src/sys/i386/include -mcmodel=kernel -mno-red-zone -mno-mmx -mno-sse -msoft-float -fno-asynchronous-unwind-tables -ffreestanding -fwrapv -fstack-protector -gdwarf-4 -Wall -Wstrict-prototypes -Wmissing-prototypes -Wpointer-arith -Wcast-qual -Wundef -Wno-pointer-sign -D__printf__=__freebsd_kprintf__ -Wmissing-include-dirs -fdiagnostics-show-option -Wno-unknown-pragmas -Wswitch -Wno-error=address -Wno-error=aggressive-loop-optimizations -Wno-error=array-bounds -Wno-error=attributes -Wno-error=cast-qual -Wno-error=enum-compare -Wno-error=maybe-uninitialized -Wno-error=misleading-indentation -Wno-error=nonnull-compare -Wno-error=overflow -Wno-error=sequence-point -Wno-error=shift-overflow -Wno-error=tautological-compare -Wno-error=unused-function -Wno-error=stringop-overflow -Wno-error=memset-elt-size -Wno-error=packed-not-aligned -Wno-address-of-packed-member -Wno-alloc-size-larger-than -Wno-error=alloca-larger-than= -Wno-error=nonnull -Wno-dangling-pointer -Wno-zero-length-bounds -Wno-return-type -Wno-format-zero-length -fms-extensions -finline-limit=8000 --param inline-unit-growth=100 --param large-function-growth=1000 -fms-extensions -std=gnu17 -Werror /workspace/src/sys/dev/fb/fb.c
--- 57711_init_values.o ---
ctfconvert -L VERSION -g 57711_init_values.o
--- atkbdc.o ---
ctfconvert -L VERSION -g atkbdc.o
--- vga.o ---
/usr/local/bin/x86_64-unknown-freebsd14.2-gcc12 --sysroot=/tmp/obj/workspace/src/amd64.amd64/tmp -B/usr/local/x86_64-unknown-freebsd14.2/bin/ -c -O2 -pipe -frename-registers -fno-strict-aliasing -g -nostdinc -I. -I/workspace/src/sys -I/workspace/src/sys/contrib/ck/include -I/workspace/src/sys/contrib/libfdt -D_KERNEL -DHAVE_KERNEL_OPTION_HEADERS -include opt_global.h -fno-common -fno-omit-frame-pointer -mno-omit-leaf-frame-pointer -MD -MF.depend.vga.o -MTvga.o -fdebug-prefix-map=./machine=/workspace/src/sys/amd64/include -fdebug-prefix-map=./x86=/workspace/src/sys/x86/include -fdebug-prefix-map=./i386=/workspace/src/sys/i386/include -mcmodel=kernel -mno-red-zone -mno-mmx -mno-sse -msoft-float -fno-asynchronous-unwind-tables -ffreestanding -fwrapv -fstack-protector -gdwarf-4 -Wall -Wstrict-prototypes -Wmissing-prototypes -Wpointer-arith -Wcast-qual -Wundef -Wno-pointer-sign -D__printf__=__freebsd_kprintf__ -Wmissing-include-dirs -fdiagnostics-show-option -Wno-unknown-pragmas -Wswitch -Wno-error=address -Wno-error=aggressive-loop-optimizations -Wno-error=array-bounds -Wno-error=attributes -Wno-error=cast-qual -Wno-error=enum-compare -Wno-error=maybe-uninitialized -Wno-error=misleading-indentation -Wno-error=nonnull-compare -Wno-error=overflow -Wno-error=sequence-point -Wno-error=shift-overflow -Wno-error=tautological-compare -Wno-error=unused-function -Wno-error=stringop-overflow -Wno-error=memset-elt-size -Wno-error=packed-not-aligned -Wno-address-of-packed-member -Wno-alloc-size-larger-than -Wno-error=alloca-larger-than= -Wno-error=nonnull -Wno-dangling-pointer -Wno-zero-length-bounds -Wno-return-type -Wno-format-zero-length -fms-extensions -finline-limit=8000 --param inline-unit-growth=100 --param large-function-growth=1000 -fms-extensions -std=gnu17 -Werror /workspace/src/sys/dev/fb/vga.c
--- fdc.o ---
/usr/local/bin/x86_64-unknown-freebsd14.2-gcc12 --sysroot=/tmp/obj/workspace/src/amd64.amd64/tmp -B/usr/local/x86_64-unknown-freebsd14.2/bin/ -c -O2 -pipe -frename-registers -fno-strict-aliasing -g -nostdinc -I. -I/workspace/src/sys -I/workspace/src/sys/contrib/ck/include -I/workspace/src/sys/contrib/libfdt -D_KERNEL -DHAVE_KERNEL_OPTION_HEADERS -include opt_global.h -fno-common -fno-omit-frame-pointer -mno-omit-leaf-frame-pointer -MD -MF.depend.fdc.o -MTfdc.o -fdebug-prefix-map=./machine=/workspace/src/sys/amd64/include -fdebug-prefix-map=./x86=/workspace/src/sys/x86/include -fdebug-prefix-map=./i386=/workspace/src/sys/i386/include -mcmodel=kernel -mno-red-zone -mno-mmx -mno-sse -msoft-float -fno-asynchronous-unwind-tables -ffreestanding -fwrapv -fstack-protector -gdwarf-4 -Wall -Wstrict-prototypes -Wmissing-prototypes -Wpointer-arith -Wcast-qual -Wundef -Wno-pointer-sign -D__printf__=__freebsd_kprintf__ -Wmissing-include-dirs -fdiagnostics-show-option -Wno-unknown-pragmas -Wswitch -Wno-error=address -Wno-error=aggressive-loop-optimizations -Wno-error=array-bounds -Wno-error=attributes -Wno-error=cast-qual -Wno-error=enum-compare -Wno-error=maybe-uninitialized -Wno-error=misleading-indentation -Wno-error=nonnull-compare -Wno-error=overflow -Wno-error=sequence-point -Wno-error=shift-overflow -Wno-error=tautological-compare -Wno-error=unused-function -Wno-error=stringop-overflow -Wno-error=memset-elt-size -Wno-error=packed-not-aligned -Wno-address-of-packed-member -Wno-alloc-size-larger-than -Wno-error=alloca-larger-than= -Wno-error=nonnull -Wno-dangling-pointer -Wno-zero-length-bounds -Wno-return-type -Wno-format-zero-length -fms-extensions -finline-limit=8000 --param inline-unit-growth=100 --param large-function-growth=1000 -fms-extensions -std=gnu17 -Werror /workspace/src/sys/dev/fdc/fdc.c
--- fb.o ---
ctfconvert -L VERSION -g fb.o
--- fdc_acpi.o ---
/usr/local/bin/x86_64-unknown-freebsd14.2-gcc12 --sysroot=/tmp/obj/workspace/src/amd64.amd64/tmp -B/usr/local/x86_64-unknown-freebsd14.2/bin/ -c -O2 -pipe -frename-registers -fno-strict-aliasing -g -nostdinc -I. -I/workspace/src/sys -I/workspace/src/sys/contrib/ck/include -I/workspace/src/sys/contrib/libfdt -D_KERNEL -DHAVE_KERNEL_OPTION_HEADERS -include opt_global.h -fno-common -fno-omit-frame-pointer -mno-omit-leaf-frame-pointer -MD -MF.depend.fdc_acpi.o -MTfdc_acpi.o -fdebug-prefix-map=./machine=/workspace/src/sys/amd64/include -fdebug-prefix-map=./x86=/workspace/src/sys/x86/include -fdebug-prefix-map=./i386=/workspace/src/sys/i386/include -mcmodel=kernel -mno-red-zone -mno-mmx -mno-sse -msoft-float -fno-asynchronous-unwind-tables -ffreestanding -fwrapv -fstack-protector -gdwarf-4 -Wall -Wstrict-prototypes -Wmissing-prototypes -Wpointer-arith -Wcast-qual -Wundef -Wno-pointer-sign -D__printf__=__freebsd_kprintf__ -Wmissing-include-dirs -fdiagnostics-show-option -Wno-unknown-pragmas -Wswitch -Wno-error=address -Wno-error=aggressive-loop-optimizations -Wno-error=array-bounds -Wno-error=attributes -Wno-error=cast-qual -Wno-error=enum-compare -Wno-error=maybe-uninitialized -Wno-error=misleading-indentation -Wno-error=nonnull-compare -Wno-error=overflow -Wno-error=sequence-point -Wno-error=shift-overflow -Wno-error=tautological-compare -Wno-error=unused-function -Wno-error=stringop-overflow -Wno-error=memset-elt-size -Wno-error=packed-not-aligned -Wno-address-of-packed-member -Wno-alloc-size-larger-than -Wno-error=alloca-larger-than= -Wno-error=nonnull -Wno-dangling-pointer -Wno-zero-length-bounds -Wno-return-type -Wno-format-zero-length -fms-extensions -finline-limit=8000 --param inline-unit-growth=100 --param large-function-growth=1000 -fms-extensions -std=gnu17 -Werror /workspace/src/sys/dev/fdc/fdc_acpi.c
--- fdc.o ---
/workspace/src/sys/dev/fdc/fdc.c: In function 'fd_probe':
/workspace/src/sys/dev/fdc/fdc.c:1974:18: warning: 'st0' may be used uninitialized [-Wmaybe-uninitialized]
1974 | (st0 & NE7_ST0_EC) != 0) /* no track 0 -> no drive present */
| ~~~~~^~~~~~~~~~~~~
/workspace/src/sys/dev/fdc/fdc.c:1885:17: note: 'st0' was declared here
1885 | u_int st0, st3;
| ^~~
--- fdc_acpi.o ---
ctfconvert -L VERSION -g fdc_acpi.o
--- fdc_isa.o ---
/usr/local/bin/x86_64-unknown-freebsd14.2-gcc12 --sysroot=/tmp/obj/workspace/src/amd64.amd64/tmp -B/usr/local/x86_64-unknown-freebsd14.2/bin/ -c -O2 -pipe -frename-registers -fno-strict-aliasing -g -nostdinc -I. -I/workspace/src/sys -I/workspace/src/sys/contrib/ck/include -I/workspace/src/sys/contrib/libfdt -D_KERNEL -DHAVE_KERNEL_OPTION_HEADERS -include opt_global.h -fno-common -fno-omit-frame-pointer -mno-omit-leaf-frame-pointer -MD -MF.depend.fdc_isa.o -MTfdc_isa.o -fdebug-prefix-map=./machine=/workspace/src/sys/amd64/include -fdebug-prefix-map=./x86=/workspace/src/sys/x86/include -fdebug-prefix-map=./i386=/workspace/src/sys/i386/include -mcmodel=kernel -mno-red-zone -mno-mmx -mno-sse -msoft-float -fno-asynchronous-unwind-tables -ffreestanding -fwrapv -fstack-protector -gdwarf-4 -Wall -Wstrict-prototypes -Wmissing-prototypes -Wpointer-arith -Wcast-qual -Wundef -Wno-pointer-sign -D__printf__=__freebsd_kprintf__ -Wmissing-include-dirs -fdiagnostics-show-option -Wno-unknown-pragmas -Wswitch -Wno-error=address -Wno-error=aggressive-loop-optimizations -Wno-error=array-bounds -Wno-error=attributes -Wno-error=cast-qual -Wno-error=enum-compare -Wno-error=maybe-uninitialized -Wno-error=misleading-indentation -Wno-error=nonnull-compare -Wno-error=overflow -Wno-error=sequence-point -Wno-error=shift-overflow -Wno-error=tautological-compare -Wno-error=unused-function -Wno-error=stringop-overflow -Wno-error=memset-elt-size -Wno-error=packed-not-aligned -Wno-address-of-packed-member -Wno-alloc-size-larger-than -Wno-error=alloca-larger-than= -Wno-error=nonnull -Wno-dangling-pointer -Wno-zero-length-bounds -Wno-return-type -Wno-format-zero-length -fms-extensions -finline-limit=8000 --param inline-unit-growth=100 --param large-function-growth=1000 -fms-extensions -std=gnu17 -Werror /workspace/src/sys/dev/fdc/fdc_isa.c
--- 57712_init_values.o ---
ctfconvert -L VERSION -g 57712_init_values.o
--- hv_sock.o ---
/usr/local/bin/x86_64-unknown-freebsd14.2-gcc12 --sysroot=/tmp/obj/workspace/src/amd64.amd64/tmp -B/usr/local/x86_64-unknown-freebsd14.2/bin/ -c -O2 -pipe -frename-registers -fno-strict-aliasing -g -nostdinc -I. -I/workspace/src/sys -I/workspace/src/sys/contrib/ck/include -I/workspace/src/sys/contrib/libfdt -D_KERNEL -DHAVE_KERNEL_OPTION_HEADERS -include opt_global.h -fno-common -fno-omit-frame-pointer -mno-omit-leaf-frame-pointer -MD -MF.depend.hv_sock.o -MThv_sock.o -fdebug-prefix-map=./machine=/workspace/src/sys/amd64/include -fdebug-prefix-map=./x86=/workspace/src/sys/x86/include -fdebug-prefix-map=./i386=/workspace/src/sys/i386/include -mcmodel=kernel -mno-red-zone -mno-mmx -mno-sse -msoft-float -fno-asynchronous-unwind-tables -ffreestanding -fwrapv -fstack-protector -gdwarf-4 -Wall -Wstrict-prototypes -Wmissing-prototypes -Wpointer-arith -Wcast-qual -Wundef -Wno-pointer-sign -D__printf__=__freebsd_kprintf__ -Wmissing-include-dirs -fdiagnostics-show-option -Wno-unknown-pragmas -Wswitch -Wno-error=address -Wno-error=aggressive-loop-optimizations -Wno-error=array-bounds -Wno-error=attributes -Wno-error=cast-qual -Wno-error=enum-compare -Wno-error=maybe-uninitialized -Wno-error=misleading-indentation -Wno-error=nonnull-compare -Wno-error=overflow -Wno-error=sequence-point -Wno-error=shift-overflow -Wno-error=tautological-compare -Wno-error=unused-function -Wno-error=stringop-overflow -Wno-error=memset-elt-size -Wno-error=packed-not-aligned -Wno-address-of-packed-member -Wno-alloc-size-larger-than -Wno-error=alloca-larger-than= -Wno-error=nonnull -Wno-dangling-pointer -Wno-zero-length-bounds -Wno-return-type -Wno-format-zero-length -fms-extensions -finline-limit=8000 --param inline-unit-growth=100 --param large-function-growth=1000 -fms-extensions -std=gnu17 -Werror /workspace/src/sys/dev/hyperv/hvsock/hv_sock.c
--- vm_page.o ---
./machine/atomic.h: Assembler messages:
./machine/atomic.h:356: Warning: 0xffffffffffffff00 shortened to 0x0
--- fdc_isa.o ---
ctfconvert -L VERSION -g fdc_isa.o
--- hv_kbd.o ---
/usr/local/bin/x86_64-unknown-freebsd14.2-gcc12 --sysroot=/tmp/obj/workspace/src/amd64.amd64/tmp -B/usr/local/x86_64-unknown-freebsd14.2/bin/ -c -O2 -pipe -frename-registers -fno-strict-aliasing -g -nostdinc -I. -I/workspace/src/sys -I/workspace/src/sys/contrib/ck/include -I/workspace/src/sys/contrib/libfdt -D_KERNEL -DHAVE_KERNEL_OPTION_HEADERS -include opt_global.h -fno-common -fno-omit-frame-pointer -mno-omit-leaf-frame-pointer -MD -MF.depend.hv_kbd.o -MThv_kbd.o -fdebug-prefix-map=./machine=/workspace/src/sys/amd64/include -fdebug-prefix-map=./x86=/workspace/src/sys/x86/include -fdebug-prefix-map=./i386=/workspace/src/sys/i386/include -mcmodel=kernel -mno-red-zone -mno-mmx -mno-sse -msoft-float -fno-asynchronous-unwind-tables -ffreestanding -fwrapv -fstack-protector -gdwarf-4 -Wall -Wstrict-prototypes -Wmissing-prototypes -Wpointer-arith -Wcast-qual -Wundef -Wno-pointer-sign -D__printf__=__freebsd_kprintf__ -Wmissing-include-dirs -fdiagnostics-show-option -Wno-unknown-pragmas -Wswitch -Wno-error=address -Wno-error=aggressive-loop-optimizations -Wno-error=array-bounds -Wno-error=attributes -Wno-error=cast-qual -Wno-error=enum-compare -Wno-error=maybe-uninitialized -Wno-error=misleading-indentation -Wno-error=nonnull-compare -Wno-error=overflow -Wno-error=sequence-point -Wno-error=shift-overflow -Wno-error=tautological-compare -Wno-error=unused-function -Wno-error=stringop-overflow -Wno-error=memset-elt-size -Wno-error=packed-not-aligned -Wno-address-of-packed-member -Wno-alloc-size-larger-than -Wno-error=alloca-larger-than= -Wno-error=nonnull -Wno-dangling-pointer -Wno-zero-length-bounds -Wno-return-type -Wno-format-zero-length -fms-extensions -finline-limit=8000 --param inline-unit-growth=100 --param large-function-growth=1000 -fms-extensions -std=gnu17 -Werror /workspace/src/sys/dev/hyperv/input/hv_kbd.c
FATAL: command execution failed
java.nio.channels.ClosedChannelException
at org.jenkinsci.remoting.protocol.impl.ChannelApplicationLayer.onReadClosed(ChannelApplicationLayer.java:241)
at org.jenkinsci.remoting.protocol.ApplicationLayer.onRecvClosed(ApplicationLayer.java:221)
at org.jenkinsci.remoting.protocol.ProtocolStack$Ptr.onRecvClosed(ProtocolStack.java:824)
at org.jenkinsci.remoting.protocol.FilterLayer.onRecvClosed(FilterLayer.java:289)
at org.jenkinsci.remoting.protocol.impl.SSLEngineFilterLayer.onRecvClosed(SSLEngineFilterLayer.java:176)
at org.jenkinsci.remoting.protocol.impl.SSLEngineFilterLayer.switchToNoSecure(SSLEngineFilterLayer.java:278)
at org.jenkinsci.remoting.protocol.impl.SSLEngineFilterLayer.processWrite(SSLEngineFilterLayer.java:505)
at org.jenkinsci.remoting.protocol.impl.SSLEngineFilterLayer.processQueuedWrites(SSLEngineFilterLayer.java:243)
at org.jenkinsci.remoting.protocol.impl.SSLEngineFilterLayer.doSend(SSLEngineFilterLayer.java:195)
at org.jenkinsci.remoting.protocol.impl.SSLEngineFilterLayer.doCloseSend(SSLEngineFilterLayer.java:208)
at org.jenkinsci.remoting.protocol.ProtocolStack$Ptr.doCloseSend(ProtocolStack.java:792)
at org.jenkinsci.remoting.protocol.ApplicationLayer.doCloseWrite(ApplicationLayer.java:172)
at org.jenkinsci.remoting.protocol.impl.ChannelApplicationLayer$ByteBufferCommandTransport.closeWrite(ChannelApplicationLayer.java:348)
at hudson.remoting.Channel.close(Channel.java:1626)
at hudson.remoting.Channel.close(Channel.java:1574)
at hudson.slaves.SlaveComputer.closeChannel(SlaveComputer.java:949)
at hudson.slaves.SlaveComputer$2.run(SlaveComputer.java:823)
at jenkins.util.ContextResettingExecutorService$1.run(ContextResettingExecutorService.java:28)
at jenkins.security.ImpersonatingExecutorService$1.run(ImpersonatingExecutorService.java:68)
at jenkins.util.ErrorLoggingExecutorService.lambda$wrap$0(ErrorLoggingExecutorService.java:51)
at java.base/java.util.concurrent.Executors$RunnableAdapter.call(Executors.java:539)
at java.base/java.util.concurrent.FutureTask.run(FutureTask.java:264)
at java.base/java.util.concurrent.ThreadPoolExecutor.runWorker(ThreadPoolExecutor.java:1136)
at java.base/java.util.concurrent.ThreadPoolExecutor$Worker.run(ThreadPoolExecutor.java:635)
at java.base/java.lang.Thread.run(Thread.java:840)
Caused: java.io.IOException: Backing channel 'JNLP4-connect connection from butler2.nyi.freebsd.org/[2610:1c1:1:607c:0:0:16:5]:18160' is disconnected.
at hudson.remoting.RemoteInvocationHandler.channelOrFail(RemoteInvocationHandler.java:227)
at hudson.remoting.RemoteInvocationHandler.invoke(RemoteInvocationHandler.java:306)
at jdk.proxy2/jdk.proxy2.$Proxy79.isAlive(Unknown Source)
at hudson.Launcher$RemoteLauncher$ProcImpl.isAlive(Launcher.java:1212)
at hudson.Launcher$RemoteLauncher$ProcImpl.join(Launcher.java:1204)
at hudson.tasks.CommandInterpreter.join(CommandInterpreter.java:195)
at hudson.tasks.CommandInterpreter.perform(CommandInterpreter.java:145)
at hudson.tasks.CommandInterpreter.perform(CommandInterpreter.java:92)
at hudson.tasks.BuildStepMonitor$1.perform(BuildStepMonitor.java:20)
at hudson.model.AbstractBuild$AbstractBuildExecution.perform(AbstractBuild.java:818)
at hudson.model.Build$BuildExecution.build(Build.java:199)
at hudson.model.Build$BuildExecution.doRun(Build.java:164)
at hudson.model.AbstractBuild$AbstractBuildExecution.run(AbstractBuild.java:527)
at hudson.model.Run.execute(Run.java:1833)
at hudson.model.FreeStyleBuild.run(FreeStyleBuild.java:44)
at hudson.model.ResourceController.execute(ResourceController.java:101)
at hudson.model.Executor.run(Executor.java:446)
FATAL: Unable to delete script file /tmp/jenkins4334253712959479548.sh
java.nio.channels.ClosedChannelException
at org.jenkinsci.remoting.protocol.impl.ChannelApplicationLayer.onReadClosed(ChannelApplicationLayer.java:241)
at org.jenkinsci.remoting.protocol.ApplicationLayer.onRecvClosed(ApplicationLayer.java:221)
at org.jenkinsci.remoting.protocol.ProtocolStack$Ptr.onRecvClosed(ProtocolStack.java:824)
at org.jenkinsci.remoting.protocol.FilterLayer.onRecvClosed(FilterLayer.java:289)
at org.jenkinsci.remoting.protocol.impl.SSLEngineFilterLayer.onRecvClosed(SSLEngineFilterLayer.java:176)
at org.jenkinsci.remoting.protocol.impl.SSLEngineFilterLayer.switchToNoSecure(SSLEngineFilterLayer.java:278)
at org.jenkinsci.remoting.protocol.impl.SSLEngineFilterLayer.processWrite(SSLEngineFilterLayer.java:505)
at org.jenkinsci.remoting.protocol.impl.SSLEngineFilterLayer.processQueuedWrites(SSLEngineFilterLayer.java:243)
at org.jenkinsci.remoting.protocol.impl.SSLEngineFilterLayer.doSend(SSLEngineFilterLayer.java:195)
at org.jenkinsci.remoting.protocol.impl.SSLEngineFilterLayer.doCloseSend(SSLEngineFilterLayer.java:208)
at org.jenkinsci.remoting.protocol.ProtocolStack$Ptr.doCloseSend(ProtocolStack.java:792)
at org.jenkinsci.remoting.protocol.ApplicationLayer.doCloseWrite(ApplicationLayer.java:172)
at org.jenkinsci.remoting.protocol.impl.ChannelApplicationLayer$ByteBufferCommandTransport.closeWrite(ChannelApplicationLayer.java:348)
at hudson.remoting.Channel.close(Channel.java:1626)
at hudson.remoting.Channel.close(Channel.java:1574)
at hudson.slaves.SlaveComputer.closeChannel(SlaveComputer.java:949)
at hudson.slaves.SlaveComputer$2.run(SlaveComputer.java:823)
at jenkins.util.ContextResettingExecutorService$1.run(ContextResettingExecutorService.java:28)
at jenkins.security.ImpersonatingExecutorService$1.run(ImpersonatingExecutorService.java:68)
at jenkins.util.ErrorLoggingExecutorService.lambda$wrap$0(ErrorLoggingExecutorService.java:51)
at java.base/java.util.concurrent.Executors$RunnableAdapter.call(Executors.java:539)
at java.base/java.util.concurrent.FutureTask.run(FutureTask.java:264)
at java.base/java.util.concurrent.ThreadPoolExecutor.runWorker(ThreadPoolExecutor.java:1136)
at java.base/java.util.concurrent.ThreadPoolExecutor$Worker.run(ThreadPoolExecutor.java:635)
at java.base/java.lang.Thread.run(Thread.java:840)
Caused: hudson.remoting.ChannelClosedException: Channel "hudson.remoting.Channel@e3cb327:JNLP4-connect connection from butler2.nyi.freebsd.org/[2610:1c1:1:607c:0:0:16:5]:18160": Remote call on JNLP4-connect connection from butler2.nyi.freebsd.org/[2610:1c1:1:607c:0:0:16:5]:18160 failed. The channel is closing down or has closed down
at hudson.remoting.Channel.call(Channel.java:1105)
at hudson.FilePath.act(FilePath.java:1207)
at hudson.FilePath.act(FilePath.java:1196)
at hudson.FilePath.delete(FilePath.java:1743)
at hudson.tasks.CommandInterpreter.perform(CommandInterpreter.java:163)
at hudson.tasks.CommandInterpreter.perform(CommandInterpreter.java:92)
at hudson.tasks.BuildStepMonitor$1.perform(BuildStepMonitor.java:20)
at hudson.model.AbstractBuild$AbstractBuildExecution.perform(AbstractBuild.java:818)
at hudson.model.Build$BuildExecution.build(Build.java:199)
at hudson.model.Build$BuildExecution.doRun(Build.java:164)
at hudson.model.AbstractBuild$AbstractBuildExecution.run(AbstractBuild.java:527)
at hudson.model.Run.execute(Run.java:1833)
at hudson.model.FreeStyleBuild.run(FreeStyleBuild.java:44)
at hudson.model.ResourceController.execute(ResourceController.java:101)
at hudson.model.Executor.run(Executor.java:446)
Build step 'Execute shell' marked build as failure
ERROR: Step ‘[Deprecated] Scan for compiler warnings’ failed: no workspace for FreeBSD-main-amd64-gcc12_build #5518
[PostBuildScript] - [INFO] Executing post build scripts.
ERROR: Build step failed with exception
java.lang.NullPointerException: no workspace from node hudson.slaves.DumbSlave[butler2.nyi.freebsd.org] which is computer hudson.slaves.SlaveComputer@50a20f45 and has channel null
at hudson.tasks.CommandInterpreter.perform(CommandInterpreter.java:114)
at hudson.tasks.CommandInterpreter.perform(CommandInterpreter.java:92)
at PluginClassLoader for postbuildscript//org.jenkinsci.plugins.postbuildscript.processor.Processor.processBuildSteps(Processor.java:178)
at PluginClassLoader for postbuildscript//org.jenkinsci.plugins.postbuildscript.processor.Processor.processScripts(Processor.java:90)
at PluginClassLoader for postbuildscript//org.jenkinsci.plugins.postbuildscript.processor.Processor.process(Processor.java:78)
at PluginClassLoader for postbuildscript//org.jenkinsci.plugins.postbuildscript.processor.Processor.process(Processor.java:72)
at PluginClassLoader for postbuildscript//org.jenkinsci.plugins.postbuildscript.PostBuildScript.perform(PostBuildScript.java:76)
at hudson.tasks.BuildStepMonitor$1.perform(BuildStepMonitor.java:20)
at hudson.model.AbstractBuild$AbstractBuildExecution.perform(AbstractBuild.java:818)
at hudson.model.AbstractBuild$AbstractBuildExecution.performAllBuildSteps(AbstractBuild.java:767)
at hudson.model.Build$BuildExecution.post2(Build.java:179)
at hudson.model.AbstractBuild$AbstractBuildExecution.post(AbstractBuild.java:711)
at hudson.model.Run.execute(Run.java:1856)
at hudson.model.FreeStyleBuild.run(FreeStyleBuild.java:44)
at hudson.model.ResourceController.execute(ResourceController.java:101)
at hudson.model.Executor.run(Executor.java:446)
Build step 'Execute scripts' marked build as failure
Checking for post-build
Performing post-build step
Checking if email needs to be generated
Email was triggered for: Failure - Any
Sending email for trigger: Failure - Any
Sending mail from default account using System Admin e-mail address
--- fdc.o ---
In function 'fdc_read_status',
inlined from 'fdc_worker' at /workspace/src/sys/dev/fdc/fdc.c:1071:6,
inlined from 'fdc_thread' at /workspace/src/sys/dev/fdc/fdc.c:1159:7:
/workspace/src/sys/dev/fdc/fdc.c:603:32: warning: 'status' may be used uninitialized [-Wmaybe-uninitialized]
603 | fdc->status[i] = status;
| ~~~~~~~~~~~~~~~^~~~~~~~
/workspace/src/sys/dev/fdc/fdc.c: In function 'fdc_thread':
/workspace/src/sys/dev/fdc/fdc.c:599:21: note: 'status' was declared here
599 | int i, ret, status;
| ^~~~~~
In function 'fd_probe_disk',
inlined from 'fdc_worker' at /workspace/src/sys/dev/fdc/fdc.c:853:7,
inlined from 'fdc_thread' at /workspace/src/sys/dev/fdc/fdc.c:1159:7:
/workspace/src/sys/dev/fdc/fdc.c:1229:26: warning: 'cyl' may be used uninitialized [-Wmaybe-uninitialized]
1229 | if ((st0 & 0xc0) || cyl != 0)
| ~~~~~~~~~~~~~^~~~~~~~~~~
/workspace/src/sys/dev/fdc/fdc.c: In function 'fdc_thread':
/workspace/src/sys/dev/fdc/fdc.c:1207:23: note: 'cyl' was declared here
1207 | int st0, st3, cyl;
| ^~~
In function 'fd_probe_disk',
inlined from 'fdc_worker' at /workspace/src/sys/dev/fdc/fdc.c:853:7,
inlined from 'fdc_thread' at /workspace/src/sys/dev/fdc/fdc.c:1159:7:
/workspace/src/sys/dev/fdc/fdc.c:1229:18: warning: 'st0' may be used uninitialized [-Wmaybe-uninitialized]
1229 | if ((st0 & 0xc0) || cyl != 0)
| ~~~~~^~~~~~~
/workspace/src/sys/dev/fdc/fdc.c: In function 'fdc_thread':
/workspace/src/sys/dev/fdc/fdc.c:1207:13: note: 'st0' was declared here
1207 | int st0, st3, cyl;
| ^~~
In function 'fdc_worker',
inlined from 'fdc_thread' at /workspace/src/sys/dev/fdc/fdc.c:1159:7:
/workspace/src/sys/dev/fdc/fdc.c:944:34: warning: 'cyl' may be used uninitialized [-Wmaybe-uninitialized]
944 | if ((st0 & 0xc0) || cyl != descyl) {
| ~~~~~~~~~~~~~^~~~~~~~~~~~~~~~
/workspace/src/sys/dev/fdc/fdc.c: In function 'fdc_thread':
/workspace/src/sys/dev/fdc/fdc.c:763:23: note: 'cyl' was declared here
763 | int st0, st3, cyl, mfm, steptrac, cylinder, descyl, sec;
| ^~~
In function 'fdc_worker',
inlined from 'fdc_thread' at /workspace/src/sys/dev/fdc/fdc.c:1159:7:
/workspace/src/sys/dev/fdc/fdc.c:944:26: warning: 'st0' may be used uninitialized [-Wmaybe-uninitialized]
944 | if ((st0 & 0xc0) || cyl != descyl) {
| ~~~~~^~~~~~~
/workspace/src/sys/dev/fdc/fdc.c: In function 'fdc_thread':
/workspace/src/sys/dev/fdc/fdc.c:763:13: note: 'st0' was declared here
763 | int st0, st3, cyl, mfm, steptrac, cylinder, descyl, sec;
| ^~~
--- vm_page.o ---
ctfconvert -L VERSION -g vm_page.o
--- hv_kbdc.o ---