FreeBSD-main-amd64-test - Build #26378 - Still Unstable
Date: Wed, 14 May 2025 08:46:34 UTC
FreeBSD-main-amd64-test - Build #26378 (15143ba61a3b154023095afa333b25592af4b904) - Still Unstable
Build information: https://ci.FreeBSD.org/job/FreeBSD-main-amd64-test/26378/
Full change log: https://ci.FreeBSD.org/job/FreeBSD-main-amd64-test/26378/changes
Full build log: https://ci.FreeBSD.org/job/FreeBSD-main-amd64-test/26378/console
Status explanation:
"Unstable" - some tests are suspected being broken by the following changes
"Still Unstable" - the failing test cases have not been fixed by these
following changes and this is a notification to note that
these changes have not been fully tested by the CI system
Change summaries:
(Those commits are likely but not certainly responsible)
91c9751c3913497db2fbad1fcf7491557bbd2a75 by ziaee:
ar40xx.4: Initial manual page
15143ba61a3b154023095afa333b25592af4b904 by markj:
sdt: Fix a typo in arm's sdt_tracepoint_valid()
The failed test cases:
4 tests failed.
FAILED: lib.libcasper.services.cap_fileargs.fileargs_test.fileargs__open_realpath
Error Message:
/usr/src/lib/libcasper/services/cap_fileargs/tests/fileargs_test.c:733: test_file_open(fa, files[i], &fd) == 0 not met
FAILED: sys.acl.03.main
Error Message:
1 of 5 tests failed
FAILED: sys.netinet.broadcast.INADDR_BROADCAST
Error Message:
/usr/src/tests/sys/netinet/broadcast.c:65: sending of broadcast failed: 51
FAILED: sys.netinet.fibs_test.same_ip_multiple_ifaces_fib0
Error Message:
atf-check failed; see the output of the test for details