FreeBSD-main-amd64-test - Build #26370 - Still Unstable
Date: Tue, 13 May 2025 12:38:22 UTC
FreeBSD-main-amd64-test - Build #26370 (fc40f4ca62ba91bef40f4a8712443617052b2cec) - Still Unstable
Build information: https://ci.FreeBSD.org/job/FreeBSD-main-amd64-test/26370/
Full change log: https://ci.FreeBSD.org/job/FreeBSD-main-amd64-test/26370/changes
Full build log: https://ci.FreeBSD.org/job/FreeBSD-main-amd64-test/26370/console
Status explanation:
"Unstable" - some tests are suspected being broken by the following changes
"Still Unstable" - the failing test cases have not been fixed by these
following changes and this is a notification to note that
these changes have not been fully tested by the CI system
Change summaries:
(Those commits are likely but not certainly responsible)
fc40f4ca62ba91bef40f4a8712443617052b2cec by bz:
iwlwifi: update script to extract firmware/chipset
The failed test cases:
6 tests failed.
FAILED: lib.libcasper.services.cap_fileargs.fileargs_test.fileargs__open_read
Error Message:
/usr/src/lib/libcasper/services/cap_fileargs/tests/fileargs_test.c:303: test_file_open(fa, files[i], &fd) == 0 not met
FAILED: lib.libcasper.services.cap_fileargs.fileargs_test.fileargs__open_realpath
Error Message:
/usr/src/lib/libcasper/services/cap_fileargs/tests/fileargs_test.c:733: test_file_open(fa, files[i], &fd) == 0 not met
FAILED: usr.sbin.traceroute.traceroute_test.ipv4_sctp
Error Message:
atf-check failed; see the output of the test for details
FAILED: sys.acl.03.main
Error Message:
1 of 5 tests failed
FAILED: sys.netinet.broadcast.INADDR_BROADCAST
Error Message:
/usr/src/tests/sys/netinet/broadcast.c:65: sending of broadcast failed: 51
FAILED: sys.netinet.fibs_test.same_ip_multiple_ifaces_fib0
Error Message:
atf-check failed; see the output of the test for details