FreeBSD-stable-14-amd64-test - Build #1165 - Still Unstable
Date: Tue, 13 May 2025 11:57:55 UTC
FreeBSD-stable-14-amd64-test - Build #1165 (1ca993dd454445ad766f8b8b39103e09c1dccce9) - Still Unstable
Build information: https://ci.FreeBSD.org/job/FreeBSD-stable-14-amd64-test/1165/
Full change log: https://ci.FreeBSD.org/job/FreeBSD-stable-14-amd64-test/1165/changes
Full build log: https://ci.FreeBSD.org/job/FreeBSD-stable-14-amd64-test/1165/console
Status explanation:
"Unstable" - some tests are suspected being broken by the following changes
"Still Unstable" - the failing test cases have not been fixed by these
following changes and this is a notification to note that
these changes have not been fully tested by the CI system
Change summaries:
(Those commits are likely but not certainly responsible)
11716164c1fef0dd00522e64cc6b578e61bb620f by olce:
queue(3): Add a test for STAILQ_REVERSE()
da6b04cd404341d494e2c89e3058ccaea5ca8a79 by olce:
stress2: exlock2.sh: Fix impact of previous '-U' removal
1ca993dd454445ad766f8b8b39103e09c1dccce9 by olce:
sysctl.9: Constant integer example: Do not promote 'debug.sizeof'
The failed test cases:
3 tests failed.
FAILED: bin.pwait.pwait_test.time_unit
Error Message:
atf-check failed; see the output of the test for details
FAILED: sys.netinet.fibs_test.same_ip_multiple_ifaces_fib0
Error Message:
atf-check failed; see the output of the test for details
FAILED: sys.netlink.test_netlink_message_writer.py.__test_cases_list__
Error Message:
Test program did not exit cleanly