FreeBSD-main-amd64-test - Build #26172 - Still Unstable
Date: Sun, 30 Mar 2025 21:25:19 UTC
FreeBSD-main-amd64-test - Build #26172 (35400672df83e337f8792df1972a15003b603930) - Still Unstable
Build information: https://ci.FreeBSD.org/job/FreeBSD-main-amd64-test/26172/
Full change log: https://ci.FreeBSD.org/job/FreeBSD-main-amd64-test/26172/changes
Full build log: https://ci.FreeBSD.org/job/FreeBSD-main-amd64-test/26172/console
Status explanation:
"Unstable" - some tests are suspected being broken by the following changes
"Still Unstable" - the failing test cases have not been fixed by these
following changes and this is a notification to note that
these changes have not been fully tested by the CI system
Change summaries:
(Those commits are likely but not certainly responsible)
e372211be5c56e218e974a4478be9aa80bfca064 by christos:
sound: Fix vchanrate and vchanformat
e1bbaa71d62c8681a576f9f5bedf475c7541bd35 by christos:
sound: Implement AFMT_FLOAT support
1166cfd96f3403edb082387fbc3a4d4aa249bce8 by christos:
beep(1): Use AFMT_FLOAT
a4aff024fd53a38ba08bbf5309589e1865ffe024 by christos:
sound: Improve afmt_tab
35400672df83e337f8792df1972a15003b603930 by christos:
sound: Use bus_topo_lock() where appropriate
The failed test cases:
8 tests failed.
FAILED: lib.libc.net.getaddrinfo.getaddrinfo.basic
Error Message:
/usr/src/lib/libc/tests/net/getaddrinfo/getaddrinfo.c:94: Expected 0, got 2 (Name could not be resolved at this time)
FAILED: lib.libc.net.getaddrinfo.getaddrinfo.nofamily
Error Message:
/usr/src/lib/libc/tests/net/getaddrinfo/getaddrinfo.c:224: Expected 1 (EAI_ADDRFAMILY), got 2 (Name could not be resolved at this time)
FAILED: lib.libc.net.getaddrinfo.getaddrinfo_test.basic
Error Message:
Test case body returned a non-ok exit code, but this is not allowed
FAILED: lib.libc.net.getaddrinfo.getaddrinfo_test.empty_servname
Error Message:
Test case body returned a non-ok exit code, but this is not allowed
FAILED: lib.libc.net.getaddrinfo.getaddrinfo_test.sock_raw
Error Message:
Test case body returned a non-ok exit code, but this is not allowed
FAILED: sys.kern.ktrace_test.ktrace__cap_sockaddr
Error Message:
/usr/src/tests/sys/kern/ktrace_test.c:133: WEXITSTATUS(error) != status
FAILED: sys.netinet.broadcast.INADDR_BROADCAST
Error Message:
/usr/src/tests/sys/netinet/broadcast.c:65: sending of broadcast failed: 51
FAILED: sys.netinet.fibs_test.same_ip_multiple_ifaces_fib0
Error Message:
atf-check failed; see the output of the test for details