FreeBSD-main-amd64-test - Build #26117 - Still Unstable
Date: Sun, 23 Mar 2025 14:55:50 UTC
FreeBSD-main-amd64-test - Build #26117 (574816356834cb99295b124be0ec34bd9e0b9c72) - Still Unstable
Build information: https://ci.FreeBSD.org/job/FreeBSD-main-amd64-test/26117/
Full change log: https://ci.FreeBSD.org/job/FreeBSD-main-amd64-test/26117/changes
Full build log: https://ci.FreeBSD.org/job/FreeBSD-main-amd64-test/26117/console
Status explanation:
"Unstable" - some tests are suspected being broken by the following changes
"Still Unstable" - the failing test cases have not been fixed by these
following changes and this is a notification to note that
these changes have not been fully tested by the CI system
Change summaries:
(Those commits are likely but not certainly responsible)
e9a846468acfbba35ca40b888670559aaff7228d by markj:
ktrace: Use STAILQ_EMPTY_ATOMIC when checking for records in userret()
574816356834cb99295b124be0ec34bd9e0b9c72 by markj:
socket: Fix a race in the SO_SPLICE state machine
The failed test cases:
6 tests failed.
FAILED: sys.kern.coredump_phnum_test.coredump_phnum
Error Message:
atf-check failed; see the output of the test for details
FAILED: sys.netipsec.tunnel.empty.v4
Error Message:
atf-check failed; see the output of the test for details
FAILED: sys.netipsec.tunnel.empty.v6
Error Message:
atf-check failed; see the output of the test for details
FAILED: sys.kern.ktrace_test.ktrace__cap_sockaddr
Error Message:
/usr/src/tests/sys/kern/ktrace_test.c:133: WEXITSTATUS(error) != status
FAILED: sys.netinet.broadcast.INADDR_BROADCAST
Error Message:
/usr/src/tests/sys/netinet/broadcast.c:65: sending of broadcast failed: 51
FAILED: sys.netinet.fibs_test.same_ip_multiple_ifaces_fib0
Error Message:
atf-check failed; see the output of the test for details