FreeBSD-main-amd64-test - Build #26114 - Still Unstable
Date: Sun, 23 Mar 2025 04:54:55 UTC
FreeBSD-main-amd64-test - Build #26114 (d2cccdef30376b7de5643caae1ef035f8e6932f0) - Still Unstable
Build information: https://ci.FreeBSD.org/job/FreeBSD-main-amd64-test/26114/
Full change log: https://ci.FreeBSD.org/job/FreeBSD-main-amd64-test/26114/changes
Full build log: https://ci.FreeBSD.org/job/FreeBSD-main-amd64-test/26114/console
Status explanation:
"Unstable" - some tests are suspected being broken by the following changes
"Still Unstable" - the failing test cases have not been fixed by these
following changes and this is a notification to note that
these changes have not been fully tested by the CI system
Change summaries:
(Those commits are likely but not certainly responsible)
09f889d4a3f4aa26f8029286f4d39de3413346fc by philip:
Import tzdata 2025b
The failed test cases:
6 tests failed.
FAILED: sys.kern.coredump_phnum_test.coredump_phnum
Error Message:
atf-check failed; see the output of the test for details
FAILED: sys.netipsec.tunnel.empty.v4
Error Message:
atf-check failed; see the output of the test for details
FAILED: sys.netipsec.tunnel.empty.v6
Error Message:
atf-check failed; see the output of the test for details
FAILED: sys.kern.ktrace_test.ktrace__cap_sockaddr
Error Message:
/usr/src/tests/sys/kern/ktrace_test.c:133: WEXITSTATUS(error) != status
FAILED: sys.netinet.broadcast.INADDR_BROADCAST
Error Message:
/usr/src/tests/sys/netinet/broadcast.c:65: sending of broadcast failed: 51
FAILED: sys.netinet.fibs_test.same_ip_multiple_ifaces_fib0
Error Message:
atf-check failed; see the output of the test for details