FreeBSD-main-amd64-test - Build #26102 - Still Unstable
Date: Thu, 20 Mar 2025 20:45:50 UTC
FreeBSD-main-amd64-test - Build #26102 (fdc4db57224ce19b867c60fce4c410068be40c27) - Still Unstable
Build information: https://ci.FreeBSD.org/job/FreeBSD-main-amd64-test/26102/
Full change log: https://ci.FreeBSD.org/job/FreeBSD-main-amd64-test/26102/changes
Full build log: https://ci.FreeBSD.org/job/FreeBSD-main-amd64-test/26102/console
Status explanation:
"Unstable" - some tests are suspected being broken by the following changes
"Still Unstable" - the failing test cases have not been fixed by these
following changes and this is a notification to note that
these changes have not been fully tested by the CI system
Change summaries:
(Those commits are likely but not certainly responsible)
fdc4db57224ce19b867c60fce4c410068be40c27 by emaste:
usr.bin/Makefile: always build ELF Tool Chain strings(1)
The failed test cases:
7 tests failed.
FAILED: sys.kern.coredump_phnum_test.coredump_phnum
Error Message:
atf-check failed; see the output of the test for details
FAILED: sys.netipsec.tunnel.empty.v4
Error Message:
atf-check failed; see the output of the test for details
FAILED: sys.netipsec.tunnel.empty.v6
Error Message:
atf-check failed; see the output of the test for details
FAILED: sys.kern.ktrace_test.ktrace__cap_sockaddr
Error Message:
/usr/src/tests/sys/kern/ktrace_test.c:133: WEXITSTATUS(error) != status
FAILED: sys.netinet.broadcast.INADDR_BROADCAST
Error Message:
/usr/src/tests/sys/netinet/broadcast.c:65: sending of broadcast failed: 51
FAILED: sys.netinet.carp.unicast_v4
Error Message:
atf-check failed; see the output of the test for details
FAILED: sys.netinet.fibs_test.same_ip_multiple_ifaces_fib0
Error Message:
atf-check failed; see the output of the test for details