FreeBSD-main-amd64-test - Build #26098 - Still Unstable
Date: Thu, 20 Mar 2025 09:43:30 UTC
FreeBSD-main-amd64-test - Build #26098 (22178cb29f03a3b7bf919f3605e0cd5d6b18fa0a) - Still Unstable
Build information: https://ci.FreeBSD.org/job/FreeBSD-main-amd64-test/26098/
Full change log: https://ci.FreeBSD.org/job/FreeBSD-main-amd64-test/26098/changes
Full build log: https://ci.FreeBSD.org/job/FreeBSD-main-amd64-test/26098/console
Status explanation:
"Unstable" - some tests are suspected being broken by the following changes
"Still Unstable" - the failing test cases have not been fixed by these
following changes and this is a notification to note that
these changes have not been fully tested by the CI system
Change summaries:
(Those commits are likely but not certainly responsible)
9e8d2962aad3af9bf1acd328a047f4745bb31086 by kp:
pf: convert DIOCRGETTSTATS to netlink
712309a64512c7e4ebf0e10de8a5c59d5a185ae8 by kp:
snmp_pf: fix pfInterfacesIfRefsState
c849f533326026501c28cb2c344b16723862551a by kp:
pf tests: add a basic snmp_pf test case
36586800803d24f1137d861bbaf487a6bde16a09 by kp:
pf tests: test table information export via snmp_pf
4c9ffb13dd74159bd3ed7e1c4c706dbd15a70df2 by kevans:
grep: avoid duplicated lines when we're coloring output
85242b59d17dcbfbc82afea9d4232006df074210 by kevans:
libc: tests: fix luacheck warnings in the fortification test generator
09cdbf042f825fc41762b5d5365ad930fec18b99 by kevans:
libc: tests: allow fortified test cases to require root
22178cb29f03a3b7bf919f3605e0cd5d6b18fa0a by kevans:
libc: tests: fix the gethostname() and getdomainname() tests
The failed test cases:
7 tests failed.
FAILED: sys.kern.coredump_phnum_test.coredump_phnum
Error Message:
atf-check failed; see the output of the test for details
FAILED: sys.netipsec.tunnel.empty.v4
Error Message:
atf-check failed; see the output of the test for details
FAILED: sys.netipsec.tunnel.empty.v6
Error Message:
atf-check failed; see the output of the test for details
FAILED: sys.kern.ktrace_test.ktrace__cap_sockaddr
Error Message:
/usr/src/tests/sys/kern/ktrace_test.c:133: WEXITSTATUS(error) != status
FAILED: sys.netinet.broadcast.INADDR_BROADCAST
Error Message:
/usr/src/tests/sys/netinet/broadcast.c:65: sending of broadcast failed: 51
FAILED: sys.netinet.carp.unicast_v4
Error Message:
atf-check failed; see the output of the test for details
FAILED: sys.netinet.fibs_test.same_ip_multiple_ifaces_fib0
Error Message:
atf-check failed; see the output of the test for details