FreeBSD-stable-14-amd64-test - Build #1011 - Still Unstable
Date: Thu, 20 Mar 2025 00:55:34 UTC
FreeBSD-stable-14-amd64-test - Build #1011 (84ca9ab010dc9bf1ce4f748100d5b15cf39f7b29) - Still Unstable
Build information: https://ci.FreeBSD.org/job/FreeBSD-stable-14-amd64-test/1011/
Full change log: https://ci.FreeBSD.org/job/FreeBSD-stable-14-amd64-test/1011/changes
Full build log: https://ci.FreeBSD.org/job/FreeBSD-stable-14-amd64-test/1011/console
Status explanation:
"Unstable" - some tests are suspected being broken by the following changes
"Still Unstable" - the failing test cases have not been fixed by these
following changes and this is a notification to note that
these changes have not been fully tested by the CI system
Change summaries:
(Those commits are likely but not certainly responsible)
6bd0e98fd3e5a6785833a33352f71ca7db56e234 by bz:
net80211: LinuxKPI 802.11: clean up MIC vs. MMIC rx flags
f966ed85ac954bfe89652eb8bce7115a9207fc82 by bz:
net80211: Fix IEEE80211_KEY_UNDEFINED() in ieee80211_node_delucastkey()
fecc36e328e7d37e68e806f8614c56264498fd99 by bz:
LinuxKPI: 802.11: improve key update locking to work around net80211
84ca9ab010dc9bf1ce4f748100d5b15cf39f7b29 by bz:
iwlwifi: adjust a debug comment referring to a PR
The failed test cases:
8 tests failed.
FAILED: sys.netinet6.frag6.frag6_19.frag6_19
Error Message:
Global IPv6 statistics do not match: 19 != 20
FAILED: sys.netinet6.ndp.ndp_slaac_default_route
Error Message:
Test case body timed out
FAILED: sys.netipsec.tunnel.empty.v4
Error Message:
atf-check failed; see the output of the test for details
FAILED: sys.netipsec.tunnel.empty.v6
Error Message:
atf-check failed; see the output of the test for details
FAILED: lib.libc.gen.getentropy_test.getentropy_sizes
Error Message:
/usr/src/lib/libc/tests/gen/getentropy_test.c:65: errno != EIO
FAILED: usr.bin.grep.grep_test.recurse_symlink
Error Message:
atf-check failed; see the output of the test for details
FAILED: sys.netmap.ctrl-api-test.main
Error Message:
Returned non-success exit status 255
FAILED: sys.netlink.test_netlink_message_writer.py.__test_cases_list__
Error Message:
Test program did not exit cleanly