FreeBSD-stable-14-amd64-test - Build #966 - Still Unstable
Date: Tue, 04 Mar 2025 16:07:23 UTC
FreeBSD-stable-14-amd64-test - Build #966 (f60149306ccf784ddaa517132a8be47bb523984d) - Still Unstable
Build information: https://ci.FreeBSD.org/job/FreeBSD-stable-14-amd64-test/966/
Full change log: https://ci.FreeBSD.org/job/FreeBSD-stable-14-amd64-test/966/changes
Full build log: https://ci.FreeBSD.org/job/FreeBSD-stable-14-amd64-test/966/console
Status explanation:
"Unstable" - some tests are suspected being broken by the following changes
"Still Unstable" - the failing test cases have not been fixed by these
following changes and this is a notification to note that
these changes have not been fully tested by the CI system
Change summaries:
(Those commits are likely but not certainly responsible)
f60149306ccf784ddaa517132a8be47bb523984d by dfr:
release: build OCI images with shell scripts
The failed test cases:
5 tests failed.
FAILED: lib.libc.gen.getentropy_test.getentropy_sizes
Error Message:
/usr/src/lib/libc/tests/gen/getentropy_test.c:65: errno != EIO
FAILED: sys.net.routing.test_routing_l3.py.TestIfOps::test_change_prefix_route[inet]
Error Message:
/usr/tests/sys/net/routing/test_routing_l3.py:42: AssertionError
FAILED: usr.bin.grep.grep_test.recurse_symlink
Error Message:
atf-check failed; see the output of the test for details
FAILED: sys.netmap.ctrl-api-test.main
Error Message:
Returned non-success exit status 255
FAILED: sys.netlink.test_netlink_message_writer.py.__test_cases_list__
Error Message:
Test program did not exit cleanly