FreeBSD-main-amd64-test - Build #26076 - Still Unstable
Date: Tue, 04 Mar 2025 12:57:26 UTC
FreeBSD-main-amd64-test - Build #26076 (7e51bc6cdd5c317109e25b0b64230d00d68dceb3) - Still Unstable
Build information: https://ci.FreeBSD.org/job/FreeBSD-main-amd64-test/26076/
Full change log: https://ci.FreeBSD.org/job/FreeBSD-main-amd64-test/26076/changes
Full build log: https://ci.FreeBSD.org/job/FreeBSD-main-amd64-test/26076/console
Status explanation:
"Unstable" - some tests are suspected being broken by the following changes
"Still Unstable" - the failing test cases have not been fixed by these
following changes and this is a notification to note that
these changes have not been fully tested by the CI system
Change summaries:
(Those commits are likely but not certainly responsible)
No changes
The failed test cases:
5 tests failed.
FAILED: sys.netpfil.pf.divert-to.in_div_in_fwd_out_div_out
Error Message:
atf-check failed; see the output of the test for details
FAILED: sys.kern.ktrace_test.ktrace__cap_sockaddr
Error Message:
/usr/src/tests/sys/kern/ktrace_test.c:133: WEXITSTATUS(error) != status
FAILED: sys.netinet.broadcast.INADDR_BROADCAST
Error Message:
/usr/src/tests/sys/netinet/broadcast.c:65: sending of broadcast failed: 51
FAILED: sys.netinet.carp.unicast_v4
Error Message:
atf-check failed; see the output of the test for details
FAILED: sys.netinet.fibs_test.same_ip_multiple_ifaces_fib0
Error Message:
atf-check failed; see the output of the test for details