FreeBSD-stable-14-amd64-test - Build #1233 - Still Unstable

From: <jenkins-admin_at_FreeBSD.org>
Date: Mon, 09 Jun 2025 14:07:50 UTC
FreeBSD-stable-14-amd64-test - Build #1233 (0fe58344e8290637c91d70142578e92bd3d1e8f7) - Still Unstable

Build information: https://ci.FreeBSD.org/job/FreeBSD-stable-14-amd64-test/1233/
Full change log: https://ci.FreeBSD.org/job/FreeBSD-stable-14-amd64-test/1233/changes
Full build log: https://ci.FreeBSD.org/job/FreeBSD-stable-14-amd64-test/1233/console

Status explanation:
"Unstable" - some tests are suspected being broken by the following changes
"Still Unstable" - the failing test cases have not been fixed by these
                   following changes and this is a notification to note that
                   these changes have not been fully tested by the CI system

Change summaries:
(Those commits are likely but not certainly responsible)

65808459e21b92c38daee8160c736dd305ff82b7 by des:
libpam: Additional module directory.

0fe58344e8290637c91d70142578e92bd3d1e8f7 by des:
netcat: Allow service names to be used.



The failed test cases:

4 tests failed.
FAILED:  sys.opencrypto.runtests.main

Error Message:
1 of 1 tests failed

FAILED:  bin.pwait.pwait_test.time_unit

Error Message:
atf-check failed; see the output of the test for details

FAILED:  sys.netinet.fibs_test.same_ip_multiple_ifaces_fib0

Error Message:
atf-check failed; see the output of the test for details

FAILED:  sys.netlink.test_netlink_message_writer.py.__test_cases_list__

Error Message:
Test program did not exit cleanly