FreeBSD-main-amd64-test - Build #26517 - Still Unstable
Date: Thu, 05 Jun 2025 09:17:22 UTC
FreeBSD-main-amd64-test - Build #26517 (4be12de1d630383ab5e0c0f3ff48aa9f2f192ab6) - Still Unstable
Build information: https://ci.FreeBSD.org/job/FreeBSD-main-amd64-test/26517/
Full change log: https://ci.FreeBSD.org/job/FreeBSD-main-amd64-test/26517/changes
Full build log: https://ci.FreeBSD.org/job/FreeBSD-main-amd64-test/26517/console
Status explanation:
"Unstable" - some tests are suspected being broken by the following changes
"Still Unstable" - the failing test cases have not been fixed by these
following changes and this is a notification to note that
these changes have not been fully tested by the CI system
Change summaries:
(Those commits are likely but not certainly responsible)
6b6542ec84462c9d1fceb43bffb832e0fd556661 by rmacklem:
open.2: Document the O_NAMEDATTR flag
1749465947a807caa53ce09b90a30b820eaab62e by rmacklem:
nfsd: Fix accumulating nfslockfile structures
4be12de1d630383ab5e0c0f3ff48aa9f2f192ab6 by rmacklem:
nfsd: Fix the build for 1749465947a8
The failed test cases:
9 tests failed.
FAILED: lib.libcasper.services.cap_fileargs.fileargs_test.fileargs__open_realpath
Error Message:
/usr/src/lib/libcasper/services/cap_fileargs/tests/fileargs_test.c:733: test_file_open(fa, files[i], &fd) == 0 not met
FAILED: sys.opencrypto.runtests.main
Error Message:
1 of 1 tests failed
FAILED: lib.libc.gen.glob2_test.glob_callback_test
Error Message:
/usr/src/lib/libc/tests/gen/glob2_test.c:152: glob(3) failed to invoke callback function
FAILED: lib.libc.gen.glob_blocks_test.glob_b_callback_test
Error Message:
/usr/src/lib/libc/tests/gen/glob_blocks_test.c:35: glob(3) failed to invoke callback block
FAILED: sys.netpfil.pf.sctp.related_icmp
Error Message:
atf-check failed; see the output of the test for details
FAILED: sys.netgraph.ksocket.udp_bind
Error Message:
/usr/src/tests/sys/netgraph/ksocket.c:104: connect(us, (struct sockaddr *)rep->data, sizeof(struct sockaddr_in)) == 0 not met
FAILED: sys.netgraph.ksocket.udp_connect
Error Message:
/usr/src/tests/sys/netgraph/ksocket.c:72: NgSendMsg(cs, ".:" OURHOOK, NGM_KSOCKET_COOKIE, NGM_KSOCKET_CONNECT, &sa, sizeof(sa)) >= 0 not met
FAILED: sys.netinet.broadcast.INADDR_BROADCAST
Error Message:
/usr/src/tests/sys/netinet/broadcast.c:65: sending of broadcast failed: 51
FAILED: sys.netinet.fibs_test.same_ip_multiple_ifaces_fib0
Error Message:
atf-check failed; see the output of the test for details