FreeBSD-main-amd64-test - Build #26710 - Still unstable

From: <jenkins-admin_at_FreeBSD.org>
Date: Thu, 03 Jul 2025 18:04:14 UTC
FreeBSD-main-amd64-test - Build #26710 (edc307eca9a9a9b0ce7445cff513b48f6489e5c6) - Still unstable

Build information: https://ci.FreeBSD.org/job/FreeBSD-main-amd64-test/26710/
Full change log: https://ci.FreeBSD.org/job/FreeBSD-main-amd64-test/26710/changes
Full build log: https://ci.FreeBSD.org/job/FreeBSD-main-amd64-test/26710/console

Status explanation:
"Unstable" - some tests are suspected being broken by the following changes
"Still Unstable" - the failing test cases have not been fixed by these
                   following changes and this is a notification to note that
                   these changes have not been fully tested by the CI system

Change summaries:
(Those commits are likely but not certainly responsible)

8213c07c20586a67bc7f7152bd7ff76c02cbc007 by zlei:
pfsync: Destroy buckets mutexes on clone destroying interface

edc307eca9a9a9b0ce7445cff513b48f6489e5c6 by zlei:
pfsync: Allocate and initialize buckets before attaching the interface



The failed test cases:

5 tests failed.
FAILED:  sbin.swapon.swapon_test.attach_dev_md

Error Message:
atf-check failed; see the output of the test for details

FAILED:  sbin.swapon.swapon_test.attach_dev_md_eli

Error Message:
atf-check failed; see the output of the test for details

FAILED:  sbin.swapon.swapon_test.attach_md

Error Message:
atf-check failed; see the output of the test for details

FAILED:  sbin.swapon.swapon_test.attach_md_eli

Error Message:
atf-check failed; see the output of the test for details

FAILED:  lib.libcasper.services.cap_fileargs.fileargs_test.fileargs__open_realpath

Error Message:
/usr/src/lib/libcasper/services/cap_fileargs/tests/fileargs_test.c:733: test_file_open(fa, files[i], &fd) == 0 not met