FreeBSD-main-amd64-test - Build #25972 - Still Unstable
Date: Tue, 28 Jan 2025 11:27:10 UTC
FreeBSD-main-amd64-test - Build #25972 (256389eaf158acaf67f0530764be8af68edee78c) - Still Unstable
Build information: https://ci.FreeBSD.org/job/FreeBSD-main-amd64-test/25972/
Full change log: https://ci.FreeBSD.org/job/FreeBSD-main-amd64-test/25972/changes
Full build log: https://ci.FreeBSD.org/job/FreeBSD-main-amd64-test/25972/console
Status explanation:
"Unstable" - some tests are suspected being broken by the following changes
"Still Unstable" - the failing test cases have not been fixed by these
following changes and this is a notification to note that
these changes have not been fully tested by the CI system
Change summaries:
(Those commits are likely but not certainly responsible)
aa90fbed151de512ab6e59f75df009533a15751f by mckusick:
Standardize the definition of a UFS dinode.
06bf119f265c38c0ed16a1461fdc43356c3edf7a by glebius:
sockets/tcp: quick fix for regression with SO_REUSEPORT_LB
256389eaf158acaf67f0530764be8af68edee78c by mckusick:
Fix build from aa90fbed151de5 by eliminating an unused variable.
The failed test cases:
4 tests failed.
FAILED: lib.csu.dynamiclib.cxx_constructors.__test_cases_list__
Error Message:
Test program did not exit cleanly
FAILED: lib.csu.dynamiclib.fini_test.__test_cases_list__
Error Message:
Test program did not exit cleanly
FAILED: lib.csu.dynamiclib.init_test.__test_cases_list__
Error Message:
Test program did not exit cleanly
FAILED: sys.net.routing.test_routing_l3.py.TestIfOps::test_change_prefix_route[inet]
Error Message:
/usr/tests/sys/net/routing/test_routing_l3.py:42: AssertionError