FreeBSD-main-amd64-test - Build #25938 - Still Unstable
Date: Mon, 20 Jan 2025 16:03:59 UTC
FreeBSD-main-amd64-test - Build #25938 (90670e0e275c6e36fc7e14368fc4e3e7f1d3671d) - Still Unstable
Build information: https://ci.FreeBSD.org/job/FreeBSD-main-amd64-test/25938/
Full change log: https://ci.FreeBSD.org/job/FreeBSD-main-amd64-test/25938/changes
Full build log: https://ci.FreeBSD.org/job/FreeBSD-main-amd64-test/25938/console
Status explanation:
"Unstable" - some tests are suspected being broken by the following changes
"Still Unstable" - the failing test cases have not been fixed by these
following changes and this is a notification to note that
these changes have not been fully tested by the CI system
Change summaries:
(Those commits are likely but not certainly responsible)
90670e0e275c6e36fc7e14368fc4e3e7f1d3671d by emaste:
jls.8: Reference correct manpage for libxo options
The failed test cases:
4 tests failed.
FAILED: lib.csu.dynamiclib.cxx_constructors.__test_cases_list__
Error Message:
Test program did not exit cleanly
FAILED: lib.csu.dynamiclib.fini_test.__test_cases_list__
Error Message:
Test program did not exit cleanly
FAILED: lib.csu.dynamiclib.init_test.__test_cases_list__
Error Message:
Test program did not exit cleanly
FAILED: sys.net.routing.test_routing_l3.py.TestIfOps::test_change_prefix_route[inet]
Error Message:
/usr/tests/sys/net/routing/test_routing_l3.py:42: AssertionError