FreeBSD-main-amd64-test - Build #25902 - Still Unstable
Date: Tue, 14 Jan 2025 16:11:19 UTC
FreeBSD-main-amd64-test - Build #25902 (b5c1f7d479de02f2c886b7453adbea312418ee7a) - Still Unstable
Build information: https://ci.FreeBSD.org/job/FreeBSD-main-amd64-test/25902/
Full change log: https://ci.FreeBSD.org/job/FreeBSD-main-amd64-test/25902/changes
Full build log: https://ci.FreeBSD.org/job/FreeBSD-main-amd64-test/25902/console
Status explanation:
"Unstable" - some tests are suspected being broken by the following changes
"Still Unstable" - the failing test cases have not been fixed by these
following changes and this is a notification to note that
these changes have not been fully tested by the CI system
Change summaries:
(Those commits are likely but not certainly responsible)
7f39f03c4d9a138f84a08931b2a6c016521cacf5 by glebius:
libc/xdr: remove bogus lseek(2) for xdr streams
b5c1f7d479de02f2c886b7453adbea312418ee7a by glebius:
xdr: use C99 initializers for xdr_ops
The failed test cases:
4 tests failed.
FAILED: lib.csu.dynamiclib.cxx_constructors.__test_cases_list__
Error Message:
Test program did not exit cleanly
FAILED: lib.csu.dynamiclib.fini_test.__test_cases_list__
Error Message:
Test program did not exit cleanly
FAILED: lib.csu.dynamiclib.init_test.__test_cases_list__
Error Message:
Test program did not exit cleanly
FAILED: sys.net.routing.test_routing_l3.py.TestIfOps::test_change_prefix_route[inet]
Error Message:
/usr/tests/sys/net/routing/test_routing_l3.py:42: AssertionError