FreeBSD-main-amd64-test - Build #25895 - Still Unstable
Date: Tue, 14 Jan 2025 04:36:52 UTC
FreeBSD-main-amd64-test - Build #25895 (84e894ce1309b426aa5d1a20ec194401f35dc478) - Still Unstable
Build information: https://ci.FreeBSD.org/job/FreeBSD-main-amd64-test/25895/
Full change log: https://ci.FreeBSD.org/job/FreeBSD-main-amd64-test/25895/changes
Full build log: https://ci.FreeBSD.org/job/FreeBSD-main-amd64-test/25895/console
Status explanation:
"Unstable" - some tests are suspected being broken by the following changes
"Still Unstable" - the failing test cases have not been fixed by these
following changes and this is a notification to note that
these changes have not been fully tested by the CI system
Change summaries:
(Those commits are likely but not certainly responsible)
b662ca1d6cd82044c6cb79075e1830b97594bef3 by dim:
Revert "Export additional __aeabi_ symbols from arm's libgcc_s"
4bce1a19fcfac0c9f22c11278daa510546ccd3f2 by tuexen:
TCP BBR: remove code which is not needed
84e894ce1309b426aa5d1a20ec194401f35dc478 by tuexen:
TCP RACK: remove variable with is only initialized and not changed
The failed test cases:
5 tests failed.
FAILED: sys.netinet6.frag6.frag6_03.frag6_03
Error Message:
atf-check failed; see the output of the test for details
FAILED: lib.csu.dynamiclib.cxx_constructors.__test_cases_list__
Error Message:
Test program did not exit cleanly
FAILED: lib.csu.dynamiclib.fini_test.__test_cases_list__
Error Message:
Test program did not exit cleanly
FAILED: lib.csu.dynamiclib.init_test.__test_cases_list__
Error Message:
Test program did not exit cleanly
FAILED: sys.net.routing.test_routing_l3.py.TestIfOps::test_change_prefix_route[inet]
Error Message:
/usr/tests/sys/net/routing/test_routing_l3.py:42: AssertionError