FreeBSD-main-amd64-test - Build #25892 - Still Unstable
Date: Mon, 13 Jan 2025 19:19:34 UTC
FreeBSD-main-amd64-test - Build #25892 (88766e7af52bbde32b14ad48fb76798a3ba4650c) - Still Unstable
Build information: https://ci.FreeBSD.org/job/FreeBSD-main-amd64-test/25892/
Full change log: https://ci.FreeBSD.org/job/FreeBSD-main-amd64-test/25892/changes
Full build log: https://ci.FreeBSD.org/job/FreeBSD-main-amd64-test/25892/console
Status explanation:
"Unstable" - some tests are suspected being broken by the following changes
"Still Unstable" - the failing test cases have not been fixed by these
following changes and this is a notification to note that
these changes have not been fully tested by the CI system
Change summaries:
(Those commits are likely but not certainly responsible)
d72f87c0fd1418bdb814594ea8fc76a202f7d5c6 by jrm:
tcpdump/print-pflog: Print uid with host endianness
88766e7af52bbde32b14ad48fb76798a3ba4650c by tuexen:
TCP BBR: fix integer overflow
The failed test cases:
4 tests failed.
FAILED: lib.csu.dynamiclib.cxx_constructors.__test_cases_list__
Error Message:
Test program did not exit cleanly
FAILED: lib.csu.dynamiclib.fini_test.__test_cases_list__
Error Message:
Test program did not exit cleanly
FAILED: lib.csu.dynamiclib.init_test.__test_cases_list__
Error Message:
Test program did not exit cleanly
FAILED: sys.net.routing.test_routing_l3.py.TestIfOps::test_change_prefix_route[inet]
Error Message:
/usr/tests/sys/net/routing/test_routing_l3.py:42: AssertionError