FreeBSD-main-amd64-test - Build #25889 - Still Unstable
Date: Mon, 13 Jan 2025 14:21:43 UTC
FreeBSD-main-amd64-test - Build #25889 (526bd072b33e3e255748e547fdc21ab15e77b709) - Still Unstable
Build information: https://ci.FreeBSD.org/job/FreeBSD-main-amd64-test/25889/
Full change log: https://ci.FreeBSD.org/job/FreeBSD-main-amd64-test/25889/changes
Full build log: https://ci.FreeBSD.org/job/FreeBSD-main-amd64-test/25889/console
Status explanation:
"Unstable" - some tests are suspected being broken by the following changes
"Still Unstable" - the failing test cases have not been fixed by these
following changes and this is a notification to note that
these changes have not been fully tested by the CI system
Change summaries:
(Those commits are likely but not certainly responsible)
2be951a526cb2ac20346b96173e553af6031a38c by adrian:
rtwn: enable VHT if it's configured in the device
64ecfc27dbd486ed764f9696b6e56f88e34ee8a1 by adrian:
rtwn: add forcerate flag to TX descriptor setup
3fb2371efd13f1067221c5fc1bae8903f358ae3e by markj:
syslogd tests: Use atf_check when sending SIGHUP to syslogd
1da99b479a741a49bfa9188925bca52345b67e68 by markj:
syslogd tests: Permit starting syslogd with multiple -b options
526bd072b33e3e255748e547fdc21ab15e77b709 by markj:
syslogd: Fix resource leaks
The failed test cases:
4 tests failed.
FAILED: lib.csu.dynamiclib.cxx_constructors.__test_cases_list__
Error Message:
Test program did not exit cleanly
FAILED: lib.csu.dynamiclib.fini_test.__test_cases_list__
Error Message:
Test program did not exit cleanly
FAILED: lib.csu.dynamiclib.init_test.__test_cases_list__
Error Message:
Test program did not exit cleanly
FAILED: sys.net.routing.test_routing_l3.py.TestIfOps::test_change_prefix_route[inet]
Error Message:
/usr/tests/sys/net/routing/test_routing_l3.py:42: AssertionError